{"text_format":"1","workbook":"xlsx","n_sheets":19,"sheets":["실행","간지(하천)","하천구역1열","하천구역국유지1열","하천구역사유지1열","간지3","예정지 집계","예정지1열","예정지지번조서","간지4","예정지 국유지 집계","예정지국유지1열","예정지국유지지번조서","간지5","예정지 사유지 집계","예정지사유지1열","예정지사유지지번조서","기존폐천1열","홍수관리구역1열"],"not_rendered":{"charts":0,"images":2,"macros":1,"external_links":0,"defined_names":16,"comments":8,"pivot_tables":0},"unopened":[],"bounds":{"document_bytes":16777216,"sheet_cells":100000,"rows_first":2000,"rows_last":500,"rows_between":2000,"halvings":0,"cell_chars":16384,"cell_head_chars":4096},"cells_cut":0,"cells_raw":0,"read":"whole","date_system":"1900"}

{"sheet":"실행","index":0,"n_rows":1,"n_cols":1,"rows_kept":1,"cut":false,"hidden":false,"merged":[]}
["03-08큰말천"]

{"sheet":"간지(하천)","index":1,"n_rows":3,"n_cols":1,"rows_kept":3,"cut":false,"hidden":false,"merged":[]}
[]
[]
["큰말천"]

{"sheet":"하천구역1열","index":2,"n_rows":3,"n_cols":17,"rows_kept":3,"cut":false,"hidden":true,"merged":[]}
["큰말천"]
["구역","시.군","구.면","동.리","번지","지목","지적","하천구역","주소","성명","구분1","구분2","하천명","PNU","전필지면적(m2)","본번","부번"]
[null,null,null,null,null,null,null,null,null,null,null,0]

{"sheet":"하천구역국유지1열","index":3,"n_rows":3,"n_cols":17,"rows_kept":3,"cut":false,"hidden":true,"merged":[]}
["큰말천"]
["구역","시.군","구.면","동.리","번지","지목","지적","하천구역","주소","성명","구분1","구분2","하천명","PNU","전필지면적(m2)","본번","부번"]
[null,null,null,null,null,null,null,null,null,null,null,0]

{"sheet":"하천구역사유지1열","index":4,"n_rows":3,"n_cols":17,"rows_kept":3,"cut":false,"hidden":true,"merged":[]}
["큰말천"]
["구역","시.군","구.면","동.리","번지","지목","지적","하천구역","주소","성명","구분1","구분2","하천명","PNU","전필지면적(m2)","본번","부번"]
[null,null,null,null,null,null,null,null,null,null,null,0]

{"sheet":"간지3","index":5,"n_rows":5,"n_cols":1,"rows_kept":5,"cut":false,"hidden":false,"merged":[[4,0,7,7]]}
[]
[]
[]
[]
["예정지"]

{"sheet":"예정지 집계","index":6,"n_rows":11,"n_cols":35,"rows_kept":11,"cut":false,"hidden":false,"merged":[[9,1,10,3],[3,5,3,33],[5,0,10,0],[1,0,1,34],[5,1,6,1],[5,2,6,2],[5,3,6,3],[7,1,8,1],[7,2,8,2],[7,3,8,3],[3,0,4,0],[3,1,4,1],[3,2,4,2],[3,3,4,3],[3,34,4,34]]}
[]
["큰말천 예정지 집계표"]
[]
["하천명","시.군","구.면","읍.리","필지수(EA)","지    목    별    구    분",null,null,null,null,null,null,null,null,null,null,null,null,null,null,null,null,null,null,null,null,null,null,null,null,null,null,null,null,"계"]
[null,null,null,null,"편입면적(m2)","천","전","답","도","대","임","구","제","잡","장","목","과","묘","유","학","철","수","차","창","가","광","염","주","양","공","체","원","종","사"]
["큰말천","홍성군","홍북읍","대동리","필지수",null,null,null,2,null,null,null,null,null,null,null,null,null,null,null,null,null,null,null,null,null,null,null,null,null,null,null,null,null,2]
[null,null,null,null,"편입면적",null,null,null,176,null,null,null,null,null,null,null,null,null,null,null,null,null,null,null,null,null,null,null,null,null,null,null,null,null,176]
[null,"홍성군","홍북읍","석택리","필지수",null,2,30,8,1,2,3,null,null,null,null,null,null,null,null,null,null,null,null,null,null,null,null,null,null,null,null,null,null,46]
[null,null,null,null,"편입면적",null,76,6995,140,2,139,278,null,null,null,null,null,null,null,null,null,null,null,null,null,null,null,null,null,null,null,null,null,null,7630]
[null,"합  계",null,null,"필지수",null,2,30,10,1,2,3,null,null,null,null,null,null,null,null,null,null,null,null,null,null,null,null,null,null,null,null,null,null,48]
[null,null,null,null,"편입면적",null,76,6995,316,2,139,278,null,null,null,null,null,null,null,null,null,null,null,null,null,null,null,null,null,null,null,null,null,null,7806]

{"sheet":"예정지1열","index":7,"n_rows":50,"n_cols":17,"rows_kept":50,"cut":false,"hidden":true,"merged":[]}
["큰말천"]
["구역","시.군","구.면","동.리","번지","지목","지적","예정지","주소","성명","구분1","구분2","하천명","PNU","전필지면적(m2)","본번","부번"]
["우01","홍성군","홍북읍","대동리",144,"도",687,8,"국(건설교통부)","국","국",1,"03-08큰말천","4480025626201440000",595,69,3]
["우01","홍성군","홍북읍","대동리","70-3","도",810,168,"홍성군","국","국",1,"03-08큰말천","4480025626200700003",821,69,4]
["우01","홍성군","홍북읍","석택리",85,"도",7539,12,"국(국토해양부)","국","국",1,"03-08큰말천","4480025627200850000",1156,85,0]
["우01","홍성군","홍북읍","석택리",243,"도",182,14,"국(농수산부)","국","국",1,"03-08큰말천","4480025627102430000",186,119,2]
["우01","홍성군","홍북읍","석택리",244,"답",1220,203,"용산리61","황선오","사",1,"03-08큰말천","4480025627102440000",1225,119,10]
["우01","홍성군","홍북읍","석택리",245,"도",1655,5,"국(농수산부)","국","국",1,"03-08큰말천","4480025627102450000",1052,119,11]
["우01","홍성군","홍북읍","석택리",275,"답",1230,415,"대동리155","표한경","사",1,"03-08큰말천","4480025627102750000",703,275,0]
["우01","홍성군","홍북읍","석택리",279,"도",833,12,"국(농수산부)","국","국",1,"03-08큰말천","4480025627102790000",834,275,1]
["우01","홍성군","홍북읍","석택리",289,"도",308,35,"국(농수산부)","국","국",1,"03-08큰말천","4480025627102890000",325,275,2]
["우01","홍성군","홍북읍","석택리",296,"도",11450,16,"국(농수산부)","국","국",1,"03-08큰말천","4480025627102960000",1468,275,3]
["우01","홍성군","홍북읍","석택리",749,"구",22779,188,"국(농수산부)","국","국",1,"03-08큰말천","4480025627107490000",10707,276,1]
["우01","홍성군","홍북읍","석택리","119-10","전",513,1,"홍성군 홍북읍 석택리 118-1","김문호","사",1,"03-08큰말천","4480025627101190010",513,276,2]
["우01","홍성군","홍북읍","석택리","119-11","전",158,75,"홍성군 홍북읍 석택리 118-1","김문호","사",1,"03-08큰말천","4480025627101190011",151,276,3]
["우01","홍성군","홍북읍","석택리","119-2","대",271,2,"충청남도홍성군홍북읍석택리119-4","김금자","사",1,"03-08큰말천","4480025627101190002",259,278,2]
["우01","홍성군","홍북읍","석택리","211-2","답",1367,16,"안양시만안구안양동823-10만안공원아파트602호","이진호","사",1,"03-08큰말천","4480025627102110002",1266,284,1]
["우01","홍성군","홍북읍","석택리","211-3","답",2335,30,"성남시분당구정자동28-1로얄팰리스씨동2904호","문세자","사",1,"03-08큰말천","4480025627102110003",2352,289,0]
["우01","홍성군","홍북읍","석택리","211-4",{"$f":"VLOOKUP(N19,#REF!,8,FALSE)","v":{"$error":"#REF!"}},{"$f":"VLOOKUP(N19,#REF!,9,FALSE)","v":{"$error":"#REF!"}},8,{"$f":"VLOOKUP(N19,#REF!,13,FALSE)","v":{"$error":"#REF!"}},{"$f":"VLOOKUP(N19,#REF!,14,FALSE)","v":{"$error":"#REF!"}},"국",1,"03-08큰말천","4480025627102110004",919,291,4]
["우01","홍성군","홍북읍","석택리","211-6",{"$f":"VLOOKUP(N20,#REF!,8,FALSE)","v":{"$error":"#REF!"}},{"$f":"VLOOKUP(N20,#REF!,9,FALSE)","v":{"$error":"#REF!"}},19,{"$f":"VLOOKUP(N20,#REF!,13,FALSE)","v":{"$error":"#REF!"}},{"$f":"VLOOKUP(N20,#REF!,14,FALSE)","v":{"$error":"#REF!"}},"국",1,"03-08큰말천","4480025627102110006",111,294,1]
["우01","홍성군","홍북읍","석택리","212-1","답",3498,202,"홍성군 홍북읍 석택리 118-2","이기호","사",1,"03-08큰말천","4480025627102120001",3494,294,3]
["우01","홍성군","홍북읍","석택리","242-3","답",1617,343,"안산시상록구1533늘푸른아파트102-302","최덕순","사",1,"03-08큰말천","4480025627102420003",1632,749,3]
["좌01","홍성군","홍북읍","석택리","246-1","답",2617,96,"홍성읍월산리850부영아파트106-804","이정규","사",1,"03-08큰말천","4480025627102460001",2621,70,3]
["좌01","홍성군","홍북읍","석택리","246-2","답",1483,102,"대전광역시유성구노은동로187608동1503호(지족동열매마을아파트6단지)","최성묵","사",1,"03-08큰말천","4480025627102460002",1495,144,0]
["좌01","홍성군","홍북읍","석택리","247-1","답",1462,45,"홍성군 홍북읍 석택리 267","임종완","사",1,"03-08큰말천","4480025627102470001",1472,211,2]
["좌01","홍성군","홍북읍","석택리","248-1","답",3682,26,"홍성군 홍북읍 석택리 267","임종완","사",1,"03-08큰말천","4480025627102480001",3696,211,3]
["좌01","홍성군","홍북읍","석택리","272-1","답",2111,47,"홍성군 홍북읍 석택리 267","임종완","사",1,"03-08큰말천","4480025627102720001",2088,211,4]
["좌01","홍성군","홍북읍","석택리","272-2","답",2185,132,"용산리87","김영금","사",1,"03-08큰말천","4480025627102720002",2187,211,6]
["좌01","홍성군","홍북읍","석택리","272-3","답",1905,236,"홍성읍오관리700-9","한영희","사",1,"03-08큰말천","4480025627102720003",1900,212,1]
["좌01","홍성군","홍북읍","석택리","274-2","답",2067,284,"대동리28-29","김진경","사",1,"03-08큰말천","4480025627102740002",2079,242,3]
{"$rows_left_out":21}
{"sheet":"예정지지번조서","index":8,"n_rows":30,"n_cols":21,"rows_kept":30,"cut":false,"hidden":false,"merged":[[0,19,0,20],[0,0,1,0],[0,1,0,4],[0,5,1,5],[0,6,1,6],[0,7,1,7],[0,8,0,9],[0,11,1,11],[0,12,0,15],[0,16,1,16],[0,17,1,17],[0,18,1,18]]}
["구역","토지소재지",null,null,null,"지목","지적","편입면적","소  유  자",null,null,"구역","토지소재지",null,null,null,"지목","지적","편입면적","소  유  자"]
[null,"시.군","구.면","동.리","번.지",null,null,null,"주   소","성   명",null,null,"시.군","구.면","동.리","번.지",null,null,null,"주   소","성   명"]
["좌안","홍성군","홍북읍","대동리","70-3","도",810,168,"홍성군","국",null,"우안","홍성군","홍북읍","석택리","69-3","임",743,60,"홍성군 홍북읍 석택리 454-5","박재순"]
[null,"홍성군","홍북읍","대동리","144","도",687,8,"국(건설교통부)","국",null,null,"홍성군","홍북읍","석택리","69-4","임",237,79,"홍성군 홍북읍 석택리 119-4","이상원"]
[null,"홍성군","홍북읍","석택리","211-2","답",1367,16,"안양시만안구안양동823-10만안공원아파트602호","이진호",null,null,"홍성군","홍북읍","석택리","85","도",7539,12,"국(국토해양부)","국"]
[null,"홍성군","홍북읍","석택리","211-3","답",2335,30,"성남시분당구정자동28-1로얄팰리스씨동2904호","문세자",null,null,"홍성군","홍북읍","석택리","119-2","대",271,2,"충청남도홍성군홍북읍석택리119-4","김금자"]
[null,"홍성군","홍북읍","석택리","211-4","답",921,8,"국(국토교통부)","국",null,null,"홍성군","홍북읍","석택리","119-10","전",513,1,"홍성군 홍북읍 석택리 118-1","김문호"]
[null,"홍성군","홍북읍","석택리","211-6","답",110,19,"국(국토교통부)","국",null,null,"홍성군","홍북읍","석택리","119-11","전",158,75,"홍성군 홍북읍 석택리 118-1","김문호"]
[null,"홍성군","홍북읍","석택리","212-1","답",3498,202,"홍성군 홍북읍 석택리 118-2","이기호",null,null,"홍성군","홍북읍","석택리","275","답",1230,415,"대동리155","표한경"]
[null,"홍성군","홍북읍","석택리","242-3","답",1617,343,"안산시상록구1533늘푸른아파트102-302","최덕순",null,null,"홍성군","홍북읍","석택리","275-1","답",392,234,"국(국토교통부)","국"]
[null,"홍성군","홍북읍","석택리","243","도",182,14,"국(농수산부)","국",null,null,"홍성군","홍북읍","석택리","275-2","답",125,60,"국(국토교통부)","국"]
[null,"홍성군","홍북읍","석택리","244","답",1220,203,"용산리61","황선오",null,null,"홍성군","홍북읍","석택리","275-3","답",3,3,"국(국토교통부)","국"]
[null,"홍성군","홍북읍","석택리","245","도",1655,5,"국(농수산부)","국",null,null,"홍성군","홍북읍","석택리","276-1","답",1003,47,"국(국토교통부)","국"]
[null,"홍성군","홍북읍","석택리","246-1","답",2617,96,"홍성읍월산리850부영아파트106-804","이정규",null,null,"홍성군","홍북읍","석택리","276-2","답",40,1,"국(국토교통부)","국"]
[null,"홍성군","홍북읍","석택리","246-2","답",1483,102,"대전광역시유성구노은동로187608동1503호(지족동열매마을아파트6단지)","최성묵",null,null,"홍성군","홍북읍","석택리","276-3","답",125,11,"국(국토교통부)","국"]
[null,"홍성군","홍북읍","석택리","247-1","답",1462,45,"홍성군 홍북읍 석택리 267","임종완",null,null,"홍성군","홍북읍","석택리","278-2","답",2870,664,"충청남도홍성군홍북읍석택리479-2","이종순"]
[null,"홍성군","홍북읍","석택리","248-1","답",3682,26,"홍성군 홍북읍 석택리 267","임종완",null,null,"홍성군","홍북읍","석택리","284-1","답",2268,752,"충청남도홍성군홍북읍홍북로502번길52-41","조성예"]
[null,"홍성군","홍북읍","석택리","272-1","답",2111,47,"홍성군 홍북읍 석택리 267","임종완",null,null,"홍성군","홍북읍","석택리","289","도",308,35,"국(농수산부)","국"]
[null,"홍성군","홍북읍","석택리","272-2","답",2185,132,"용산리87","김영금",null,null,"홍성군","홍북읍","석택리","291-4","답",2158,811,"홍성군홍북읍대동리38-12","임동찬"]
[null,"홍성군","홍북읍","석택리","272-3","답",1905,236,"홍성읍오관리700-9","한영희",null,null,"홍성군","홍북읍","석택리","294-1","답",1290,613,"대전시중구문화동775주공아파트203-902","고이순"]
[null,"홍성군","홍북읍","석택리","274-2","답",2067,284,"대동리28-29","김진경",null,null,"홍성군","홍북읍","석택리","294-3","도",128,30,"국(농수산부)","국"]
[null,"홍성군","홍북읍","석택리","279","도",833,12,"국(농수산부)","국",null,null,"홍성군","홍북읍","석택리","749-3","구",10646,19,"국(농수산부)","국"]
[null,"홍성군","홍북읍","석택리","281-1","답",2953,285,"대동리28-29","김진경"]
[null,"홍성군","홍북읍","석택리","282-5","답",1320,549,"용인시수지구풍덕천동1060신정마을7단지아파트707-1205","남상호"]
[null,"홍성군","홍북읍","석택리","292-1","도",787,16,"국(농수산부)","국"]
[null,"홍성군","홍북읍","석택리","292-2","답",2908,454,"남양주시도농동2-1부영그린타운214-804","한덕전"]
[null,"홍성군","홍북읍","석택리","293-4","답",1298,307,"대동리152-3","박인화"]
[null,"홍성군","홍북읍","석택리","296","도",11450,16,"국(농수산부)","국"]
[null,"홍성군","홍북읍","석택리","744-2","구",36345,71,"국(농수산부)","국"]
[null,"홍성군","홍북읍","석택리","749","구",22779,188,"국(농수산부)","국"]
{"$rows_left_out":1}
{"sheet":"간지4","index":9,"n_rows":5,"n_cols":1,"rows_kept":5,"cut":false,"hidden":false,"merged":[[4,0,7,7]]}
[]
[]
[]
[]
["예정지 국유지"]

{"sheet":"예정지 국유지 집계","index":10,"n_rows":11,"n_cols":35,"rows_kept":11,"cut":false,"hidden":false,"merged":[[9,1,10,3],[3,5,3,33],[5,0,10,0],[1,0,1,34],[5,1,6,1],[5,2,6,2],[5,3,6,3],[7,1,8,1],[7,2,8,2],[7,3,8,3],[3,0,4,0],[3,1,4,1],[3,2,4,2],[3,3,4,3],[3,34,4,34]]}
[]
["큰말천 예정지 국유지 집계표"]
[]
["하천명","시.군","구.면","읍.리","필지수(EA)","지    목    별    구    분",null,null,null,null,null,null,null,null,null,null,null,null,null,null,null,null,null,null,null,null,null,null,null,null,null,null,null,null,"계"]
[null,null,null,null,"편입면적(m2)","천","전","답","도","대","임","구","제","잡","장","목","과","묘","유","학","철","수","차","창","가","광","염","주","양","공","체","원","종","사"]
["큰말천","홍성군","홍북읍","대동리","필지수",null,null,null,2,null,null,null,null,null,null,null,null,null,null,null,null,null,null,null,null,null,null,null,null,null,null,null,null,null,2]
[null,null,null,null,"편입면적",null,null,null,176,null,null,null,null,null,null,null,null,null,null,null,null,null,null,null,null,null,null,null,null,null,null,null,null,null,176]
[null,"홍성군","홍북읍","석택리","필지수",null,null,8,8,null,null,3,null,null,null,null,null,null,null,null,null,null,null,null,null,null,null,null,null,null,null,null,null,null,19]
[null,null,null,null,"편입면적",null,null,383,140,null,null,278,null,null,null,null,null,null,null,null,null,null,null,null,null,null,null,null,null,null,null,null,null,null,801]
[null,"합  계",null,null,"필지수",null,null,8,10,null,null,3,null,null,null,null,null,null,null,null,null,null,null,null,null,null,null,null,null,null,null,null,null,null,21]
[null,null,null,null,"편입면적",null,null,383,316,null,null,278,null,null,null,null,null,null,null,null,null,null,null,null,null,null,null,null,null,null,null,null,null,null,977]

{"sheet":"예정지국유지1열","index":11,"n_rows":23,"n_cols":17,"rows_kept":23,"cut":false,"hidden":true,"merged":[]}
["큰말천"]
["구역","시.군","구.면","동.리","번지","지목","지적","예정지","주소","성명","구분1","구분2","하천명","PNU","전필지면적(m2)","본번","부번"]
["우01","홍성군","홍북읍","대동리",144,"도",687,8,"국(건설교통부)","국","국",1,"03-08큰말천","4480025626201440000",595,85,0]
["우01","홍성군","홍북읍","대동리","70-3","도",810,168,"홍성군","국","국",1,"03-08큰말천","4480025626200700003",821,275,1]
["우01","홍성군","홍북읍","석택리",85,"도",7539,12,"국(국토해양부)","국","국",1,"03-08큰말천","4480025627200850000",1156,275,2]
["우01","홍성군","홍북읍","석택리",243,"도",182,14,"국(농수산부)","국","국",1,"03-08큰말천","4480025627102430000",186,275,3]
["우01","홍성군","홍북읍","석택리",245,"도",1655,5,"국(농수산부)","국","국",1,"03-08큰말천","4480025627102450000",1052,276,1]
["우01","홍성군","홍북읍","석택리",279,"도",833,12,"국(농수산부)","국","국",1,"03-08큰말천","4480025627102790000",834,276,2]
["우01","홍성군","홍북읍","석택리",289,"도",308,35,"국(농수산부)","국","국",1,"03-08큰말천","4480025627102890000",325,276,3]
["우01","홍성군","홍북읍","석택리",296,"도",11450,16,"국(농수산부)","국","국",1,"03-08큰말천","4480025627102960000",1468,289,0]
["우01","홍성군","홍북읍","석택리",749,"구",22779,188,"국(농수산부)","국","국",1,"03-08큰말천","4480025627107490000",10707,294,3]
["우01","홍성군","홍북읍","석택리","211-4","답",921,8,"국(국토교통부)","국","국",1,"03-08큰말천","4480025627102110004",919,749,3]
["좌01","홍성군","홍북읍","석택리","211-6","답",110,19,"국(국토교통부)","국","국",1,"03-08큰말천","4480025627102110006",111,70,3]
["좌01","홍성군","홍북읍","석택리","275-1","답",392,234,"국(국토교통부)","국","국",1,"03-08큰말천","4480025627102750001",388,144,0]
["좌01","홍성군","홍북읍","석택리","275-2","답",125,60,"국(국토교통부)","국","국",1,"03-08큰말천","4480025627102750002",124,211,4]
["좌01","홍성군","홍북읍","석택리","275-3","답",3,3,"국(국토교통부)","국","국",1,"03-08큰말천","4480025627102750003",3,211,6]
["좌01","홍성군","홍북읍","석택리","276-1","답",1003,47,"국(국토교통부)","국","국",1,"03-08큰말천","4480025627102760001",1004,243,0]
["좌01","홍성군","홍북읍","석택리","276-2","답",40,1,"국(국토교통부)","국","국",1,"03-08큰말천","4480025627102760002",40,245,0]
["좌01","홍성군","홍북읍","석택리","276-3","답",125,11,"국(국토교통부)","국","국",1,"03-08큰말천","4480025627102760003",126,279,0]
["좌01","홍성군","홍북읍","석택리","292-1","도",787,16,"국(농수산부)","국","국",1,"03-08큰말천","4480025627102920001",821,292,1]
["좌01","홍성군","홍북읍","석택리","294-3","도",128,30,"국(농수산부)","국","국",1,"03-08큰말천","4480025627102940003",131,296,0]
["좌01","홍성군","홍북읍","석택리","744-2","구",36345,71,"국(농수산부)","국","국",1,"03-08큰말천","4480025627107440002",10908,744,2]
["좌01","홍성군","홍북읍","석택리","749-3","구",10646,19,"국(농수산부)","국","국",1,"03-08큰말천","4480025627107490003",10521,749,0]

{"sheet":"예정지국유지지번조서","index":12,"n_rows":13,"n_cols":21,"rows_kept":13,"cut":false,"hidden":false,"merged":[[0,19,0,20],[0,0,1,0],[0,1,0,4],[0,5,1,5],[0,6,1,6],[0,7,1,7],[0,8,0,9],[0,11,1,11],[0,12,0,15],[0,16,1,16],[0,17,1,17],[0,18,1,18]]}
["구역","토지소재지",null,null,null,"지목","지적","편입면적","소  유  자",null,null,"구역","토지소재지",null,null,null,"지목","지적","편입면적","소  유  자"]
[null,"시.군","구.면","동.리","번.지",null,null,null,"주   소","성   명",null,null,"시.군","구.면","동.리","번.지",null,null,null,"주   소","성   명"]
["좌안","홍성군","홍북읍","대동리","70-3","도",810,168,"홍성군","국",null,"우안","홍성군","홍북읍","석택리","85","도",7539,12,"국(국토해양부)","국"]
[null,"홍성군","홍북읍","대동리","144","도",687,8,"국(건설교통부)","국",null,null,"홍성군","홍북읍","석택리","275-1","답",392,234,"국(국토교통부)","국"]
[null,"홍성군","홍북읍","석택리","211-4","답",921,8,"국(국토교통부)","국",null,null,"홍성군","홍북읍","석택리","275-2","답",125,60,"국(국토교통부)","국"]
[null,"홍성군","홍북읍","석택리","211-6","답",110,19,"국(국토교통부)","국",null,null,"홍성군","홍북읍","석택리","275-3","답",3,3,"국(국토교통부)","국"]
[null,"홍성군","홍북읍","석택리","243","도",182,14,"국(농수산부)","국",null,null,"홍성군","홍북읍","석택리","276-1","답",1003,47,"국(국토교통부)","국"]
[null,"홍성군","홍북읍","석택리","245","도",1655,5,"국(농수산부)","국",null,null,"홍성군","홍북읍","석택리","276-2","답",40,1,"국(국토교통부)","국"]
[null,"홍성군","홍북읍","석택리","279","도",833,12,"국(농수산부)","국",null,null,"홍성군","홍북읍","석택리","276-3","답",125,11,"국(국토교통부)","국"]
[null,"홍성군","홍북읍","석택리","292-1","도",787,16,"국(농수산부)","국",null,null,"홍성군","홍북읍","석택리","289","도",308,35,"국(농수산부)","국"]
[null,"홍성군","홍북읍","석택리","296","도",11450,16,"국(농수산부)","국",null,null,"홍성군","홍북읍","석택리","294-3","도",128,30,"국(농수산부)","국"]
[null,"홍성군","홍북읍","석택리","744-2","구",36345,71,"국(농수산부)","국",null,null,"홍성군","홍북읍","석택리","749-3","구",10646,19,"국(농수산부)","국"]
[null,"홍성군","홍북읍","석택리","749","구",22779,188,"국(농수산부)","국"]

{"sheet":"간지5","index":13,"n_rows":5,"n_cols":1,"rows_kept":5,"cut":false,"hidden":false,"merged":[[4,0,7,7]]}
[]
[]
[]
[]
["예정지 사유지"]

{"sheet":"예정지 사유지 집계","index":14,"n_rows":9,"n_cols":35,"rows_kept":9,"cut":false,"hidden":false,"merged":[[7,1,8,3],[3,5,3,33],[5,0,8,0],[1,0,1,34],[5,1,6,1],[5,2,6,2],[5,3,6,3],[3,0,4,0],[3,1,4,1],[3,2,4,2],[3,3,4,3],[3,34,4,34]]}
[]
["큰말천 예정지 사유지 집계표"]
[]
["하천명","시.군","구.면","읍.리","필지수(EA)","지    목    별    구    분",null,null,null,null,null,null,null,null,null,null,null,null,null,null,null,null,null,null,null,null,null,null,null,null,null,null,null,null,"계"]
[null,null,null,null,"편입면적(m2)","천","전","답","도","대","임","구","제","잡","장","목","과","묘","유","학","철","수","차","창","가","광","염","주","양","공","체","원","종","사"]
["큰말천","홍성군","홍북읍","석택리","필지수",null,2,22,null,1,2,null,null,null,null,null,null,null,null,null,null,null,null,null,null,null,null,null,null,null,null,null,null,null,27]
[null,null,null,null,"편입면적",null,76,6612,null,2,139,null,null,null,null,null,null,null,null,null,null,null,null,null,null,null,null,null,null,null,null,null,null,null,6829]
[null,"합  계",null,null,"필지수",null,2,22,null,1,2,null,null,null,null,null,null,null,null,null,null,null,null,null,null,null,null,null,null,null,null,null,null,null,27]
[null,null,null,null,"편입면적",null,76,6612,null,2,139,null,null,null,null,null,null,null,null,null,null,null,null,null,null,null,null,null,null,null,null,null,null,null,6829]

{"sheet":"예정지사유지1열","index":15,"n_rows":29,"n_cols":17,"rows_kept":29,"cut":false,"hidden":true,"merged":[]}
["큰말천"]
["구역","시.군","구.면","동.리","번지","지목","지적","예정지","주소","성명","구분1","구분2","하천명","PNU","전필지면적(m2)","본번","부번"]
["우01","홍성군","홍북읍","석택리",244,"답",1220,203,"용산리61","황선오","사",1,"03-08큰말천","4480025627102440000",1225,69,3]
["우01","홍성군","홍북읍","석택리",275,"답",1230,415,"대동리155","표한경","사",1,"03-08큰말천","4480025627102750000",703,69,4]
["우01","홍성군","홍북읍","석택리","119-10","전",513,1,"홍성군 홍북읍 석택리 118-1","김문호","사",1,"03-08큰말천","4480025627101190010",513,119,2]
["우01","홍성군","홍북읍","석택리","119-11","전",158,75,"홍성군 홍북읍 석택리 118-1","김문호","사",1,"03-08큰말천","4480025627101190011",151,119,10]
["우01","홍성군","홍북읍","석택리","119-2","대",271,2,"충청남도홍성군홍북읍석택리119-4","김금자","사",1,"03-08큰말천","4480025627101190002",259,119,11]
["우01","홍성군","홍북읍","석택리","211-2","답",1367,16,"안양시만안구안양동823-10만안공원아파트602호","이진호","사",1,"03-08큰말천","4480025627102110002",1266,275,0]
["우01","홍성군","홍북읍","석택리","211-3","답",2335,30,"성남시분당구정자동28-1로얄팰리스씨동2904호","문세자","사",1,"03-08큰말천","4480025627102110003",2352,278,2]
["우01","홍성군","홍북읍","석택리","212-1","답",3498,202,"홍성군 홍북읍 석택리 118-2","이기호","사",1,"03-08큰말천","4480025627102120001",3494,284,1]
["우01","홍성군","홍북읍","석택리","242-3","답",1617,343,"안산시상록구1533늘푸른아파트102-302","최덕순","사",1,"03-08큰말천","4480025627102420003",1632,291,4]
["우01","홍성군","홍북읍","석택리","246-1","답",2617,96,"홍성읍월산리850부영아파트106-804","이정규","사",1,"03-08큰말천","4480025627102460001",2621,294,1]
["좌01","홍성군","홍북읍","석택리","246-2","답",1483,102,"대전광역시유성구노은동로187608동1503호(지족동열매마을아파트6단지)","최성묵","사",1,"03-08큰말천","4480025627102460002",1495,211,2]
["좌01","홍성군","홍북읍","석택리","247-1","답",1462,45,"홍성군 홍북읍 석택리 267","임종완","사",1,"03-08큰말천","4480025627102470001",1472,211,3]
["좌01","홍성군","홍북읍","석택리","248-1","답",3682,26,"홍성군 홍북읍 석택리 267","임종완","사",1,"03-08큰말천","4480025627102480001",3696,212,1]
["좌01","홍성군","홍북읍","석택리","272-1","답",2111,47,"홍성군 홍북읍 석택리 267","임종완","사",1,"03-08큰말천","4480025627102720001",2088,242,3]
["좌01","홍성군","홍북읍","석택리","272-2","답",2185,132,"용산리87","김영금","사",1,"03-08큰말천","4480025627102720002",2187,244,0]
["좌01","홍성군","홍북읍","석택리","272-3","답",1905,236,"홍성읍오관리700-9","한영희","사",1,"03-08큰말천","4480025627102720003",1900,246,1]
["좌01","홍성군","홍북읍","석택리","274-2","답",2067,284,"대동리28-29","김진경","사",1,"03-08큰말천","4480025627102740002",2079,246,2]
["좌01","홍성군","홍북읍","석택리","278-2","답",2870,664,"충청남도홍성군홍북읍석택리479-2","이종순","사",1,"03-08큰말천","4480025627102780002",2869,247,1]
["좌01","홍성군","홍북읍","석택리","281-1","답",2953,285,"대동리28-29","김진경","사",1,"03-08큰말천","4480025627102810001",2926,248,1]
["좌01","홍성군","홍북읍","석택리","282-5","답",1320,549,"용인시수지구풍덕천동1060신정마을7단지아파트707-1205","남상호","사",1,"03-08큰말천","4480025627102820005",1315,272,1]
["좌01","홍성군","홍북읍","석택리","284-1","답",2268,752,"충청남도홍성군홍북읍홍북로502번길52-41","조성예","사",1,"03-08큰말천","4480025627102840001",2265,272,2]
["좌01","홍성군","홍북읍","석택리","291-4","답",2158,811,"홍성군홍북읍대동리38-12","임동찬","사",1,"03-08큰말천","4480025627102910004",2157,272,3]
["좌01","홍성군","홍북읍","석택리","292-2","답",2908,454,"남양주시도농동2-1부영그린타운214-804","한덕전","사",1,"03-08큰말천","4480025627102920002",2893,274,2]
["좌01","홍성군","홍북읍","석택리","293-4","답",1298,307,"대동리152-3","박인화","사",1,"03-08큰말천","4480025627102930004",1299,281,1]
["좌01","홍성군","홍북읍","석택리","294-1","답",1290,613,"대전시중구문화동775주공아파트203-902","고이순","사",1,"03-08큰말천","4480025627102940001",1295,282,5]
["좌01","홍성군","홍북읍","석택리","69-3","임",743,60,"홍성군 홍북읍 석택리 454-5","박재순","사",1,"03-08큰말천","4480025627200690003",817,292,2]
["좌01","홍성군","홍북읍","석택리","69-4","임",237,79,"홍성군 홍북읍 석택리 119-4","이상원","사",1,"03-08큰말천","4480025627200690004",309,293,4]

{"sheet":"예정지사유지지번조서","index":16,"n_rows":19,"n_cols":21,"rows_kept":19,"cut":false,"hidden":false,"merged":[[0,19,0,20],[0,0,1,0],[0,1,0,4],[0,5,1,5],[0,6,1,6],[0,7,1,7],[0,8,0,9],[0,11,1,11],[0,12,0,15],[0,16,1,16],[0,17,1,17],[0,18,1,18]]}
["구역","토지소재지",null,null,null,"지목","지적","편입면적","소  유  자",null,null,"구역","토지소재지",null,null,null,"지목","지적","편입면적","소  유  자"]
[null,"시.군","구.면","동.리","번.지",null,null,null,"주   소","성   명",null,null,"시.군","구.면","동.리","번.지",null,null,null,"주   소","성   명"]
["좌안","홍성군","홍북읍","석택리","211-2","답",1367,16,"안양시만안구안양동823-10만안공원아파트602호","이진호",null,"우안","홍성군","홍북읍","석택리","69-3","임",743,60,"홍성군 홍북읍 석택리 454-5","박재순"]
[null,"홍성군","홍북읍","석택리","211-3","답",2335,30,"성남시분당구정자동28-1로얄팰리스씨동2904호","문세자",null,null,"홍성군","홍북읍","석택리","69-4","임",237,79,"홍성군 홍북읍 석택리 119-4","이상원"]
[null,"홍성군","홍북읍","석택리","212-1","답",3498,202,"홍성군 홍북읍 석택리 118-2","이기호",null,null,"홍성군","홍북읍","석택리","119-2","대",271,2,"충청남도홍성군홍북읍석택리119-4","김금자"]
[null,"홍성군","홍북읍","석택리","242-3","답",1617,343,"안산시상록구1533늘푸른아파트102-302","최덕순",null,null,"홍성군","홍북읍","석택리","119-10","전",513,1,"홍성군 홍북읍 석택리 118-1","김문호"]
[null,"홍성군","홍북읍","석택리","244","답",1220,203,"용산리61","황선오",null,null,"홍성군","홍북읍","석택리","119-11","전",158,75,"홍성군 홍북읍 석택리 118-1","김문호"]
[null,"홍성군","홍북읍","석택리","246-1","답",2617,96,"홍성읍월산리850부영아파트106-804","이정규",null,null,"홍성군","홍북읍","석택리","275","답",1230,415,"대동리155","표한경"]
[null,"홍성군","홍북읍","석택리","246-2","답",1483,102,"대전광역시유성구노은동로187608동1503호(지족동열매마을아파트6단지)","최성묵",null,null,"홍성군","홍북읍","석택리","278-2","답",2870,664,"충청남도홍성군홍북읍석택리479-2","이종순"]
[null,"홍성군","홍북읍","석택리","247-1","답",1462,45,"홍성군 홍북읍 석택리 267","임종완",null,null,"홍성군","홍북읍","석택리","284-1","답",2268,752,"충청남도홍성군홍북읍홍북로502번길52-41","조성예"]
[null,"홍성군","홍북읍","석택리","248-1","답",3682,26,"홍성군 홍북읍 석택리 267","임종완",null,null,"홍성군","홍북읍","석택리","291-4","답",2158,811,"홍성군홍북읍대동리38-12","임동찬"]
[null,"홍성군","홍북읍","석택리","272-1","답",2111,47,"홍성군 홍북읍 석택리 267","임종완",null,null,"홍성군","홍북읍","석택리","294-1","답",1290,613,"대전시중구문화동775주공아파트203-902","고이순"]
[null,"홍성군","홍북읍","석택리","272-2","답",2185,132,"용산리87","김영금"]
[null,"홍성군","홍북읍","석택리","272-3","답",1905,236,"홍성읍오관리700-9","한영희"]
[null,"홍성군","홍북읍","석택리","274-2","답",2067,284,"대동리28-29","김진경"]
[null,"홍성군","홍북읍","석택리","281-1","답",2953,285,"대동리28-29","김진경"]
[null,"홍성군","홍북읍","석택리","282-5","답",1320,549,"용인시수지구풍덕천동1060신정마을7단지아파트707-1205","남상호"]
[null,"홍성군","홍북읍","석택리","292-2","답",2908,454,"남양주시도농동2-1부영그린타운214-804","한덕전"]
[null,"홍성군","홍북읍","석택리","293-4","답",1298,307,"대동리152-3","박인화"]

{"sheet":"기존폐천1열","index":17,"n_rows":3,"n_cols":17,"rows_kept":3,"cut":false,"hidden":true,"merged":[]}
["큰말천"]
["구역","시.군","구.면","동.리","번지","지목","지적","폐천구역","주소","성명","구분1","구분2","하천명","PNU","전필지면적(m2)","본번","부번"]
[null,null,null,null,null,null,null,null,null,null,null,0]

{"sheet":"홍수관리구역1열","index":18,"n_rows":3,"n_cols":17,"rows_kept":3,"cut":false,"hidden":true,"merged":[]}
["큰말천"]
["구역","시.군","구.면","동.리","번지","지목","지적","홍수관리구역","주소","성명","구분1","구분2","하천명","PNU","전필지면적(m2)","본번","부번"]
[null,null,null,null,null,null,null,null,null,null,"사",0]