{"text_format":"1","workbook":"xlsx","n_sheets":19,"sheets":["실행","간지(하천)","하천구역1열","하천구역국유지1열","하천구역사유지1열","간지3","예정지 집계","예정지1열","예정지지번조서","간지4","예정지 국유지 집계","예정지국유지1열","예정지국유지지번조서","간지5","예정지 사유지 집계","예정지사유지1열","예정지사유지지번조서","기존폐천1열","홍수관리구역1열"],"not_rendered":{"charts":0,"images":2,"macros":1,"external_links":0,"defined_names":16,"comments":8,"pivot_tables":0},"unopened":[],"bounds":{"document_bytes":16777216,"sheet_cells":100000,"rows_first":2000,"rows_last":500,"rows_between":2000,"halvings":0,"cell_chars":16384,"cell_head_chars":4096},"cells_cut":0,"cells_raw":0,"read":"whole","date_system":"1900"}

{"sheet":"실행","index":0,"n_rows":1,"n_cols":1,"rows_kept":1,"cut":false,"hidden":false,"merged":[]}
["10-07신곡천"]

{"sheet":"간지(하천)","index":1,"n_rows":3,"n_cols":1,"rows_kept":3,"cut":false,"hidden":false,"merged":[]}
[]
[]
["신곡천"]

{"sheet":"하천구역1열","index":2,"n_rows":3,"n_cols":17,"rows_kept":3,"cut":false,"hidden":true,"merged":[]}
["신곡천"]
["구역","시.군","구.면","동.리","번지","지목","지적","하천구역","주소","성명","구분1","구분2","하천명","PNU","전필지면적(m2)","본번","부번"]
[null,null,null,null,null,null,null,null,null,null,null,0]

{"sheet":"하천구역국유지1열","index":3,"n_rows":3,"n_cols":17,"rows_kept":3,"cut":false,"hidden":true,"merged":[]}
["신곡천"]
["구역","시.군","구.면","동.리","번지","지목","지적","하천구역","주소","성명","구분1","구분2","하천명","PNU","전필지면적(m2)","본번","부번"]
[null,null,null,null,null,null,null,null,null,null,null,0]

{"sheet":"하천구역사유지1열","index":4,"n_rows":3,"n_cols":17,"rows_kept":3,"cut":false,"hidden":true,"merged":[]}
["신곡천"]
["구역","시.군","구.면","동.리","번지","지목","지적","하천구역","주소","성명","구분1","구분2","하천명","PNU","전필지면적(m2)","본번","부번"]
[null,null,null,null,null,null,null,null,null,null,null,0]

{"sheet":"간지3","index":5,"n_rows":5,"n_cols":1,"rows_kept":5,"cut":false,"hidden":false,"merged":[[4,0,7,7]]}
[]
[]
[]
[]
["예정지"]

{"sheet":"예정지 집계","index":6,"n_rows":9,"n_cols":35,"rows_kept":9,"cut":false,"hidden":false,"merged":[[7,1,8,3],[3,5,3,33],[5,0,8,0],[1,0,1,34],[5,1,6,1],[5,2,6,2],[5,3,6,3],[3,0,4,0],[3,1,4,1],[3,2,4,2],[3,3,4,3],[3,34,4,34]]}
[]
["신곡천 예정지 집계표"]
[]
["하천명","시.군","구.면","읍.리","필지수(EA)","지    목    별    구    분",null,null,null,null,null,null,null,null,null,null,null,null,null,null,null,null,null,null,null,null,null,null,null,null,null,null,null,null,"계"]
[null,null,null,null,"편입면적(m2)","천","전","답","도","대","임","구","제","잡","장","목","과","묘","유","학","철","수","차","창","가","광","염","주","양","공","체","원","종","사"]
["신곡천","홍성군","갈산면","운곡리","필지수",1,1,7,2,1,null,1,1,null,null,null,null,null,null,null,null,null,null,null,null,null,null,null,null,null,null,null,null,null,14]
[null,null,null,null,"편입면적",51,102,390,32,14,null,56,1,null,null,null,null,null,null,null,null,null,null,null,null,null,null,null,null,null,null,null,null,null,646]
[null,"합  계",null,null,"필지수",1,1,7,2,1,null,1,1,null,null,null,null,null,null,null,null,null,null,null,null,null,null,null,null,null,null,null,null,null,14]
[null,null,null,null,"편입면적",51,102,390,32,14,null,56,1,null,null,null,null,null,null,null,null,null,null,null,null,null,null,null,null,null,null,null,null,null,646]

{"sheet":"예정지1열","index":7,"n_rows":17,"n_cols":17,"rows_kept":17,"cut":false,"hidden":true,"merged":[]}
["신곡천"]
["구역","시.군","구.면","동.리","번지","지목","지적","예정지","주소","성명","구분1","구분2","하천명","PNU","전필지면적(m2)","본번","부번"]
["우안","홍성군","갈산면","운곡리",155,"답",592,63,"홍성군 갈산면 운곡리 213","이은섭","사",1,"10-07신곡천","4480038034101550000",579,{"$f":"G3-H3","v":529}]
["우안","홍성군","갈산면","운곡리",188,"전",278,102," 인천광역시 남동구 만수서로 55  137동 1102호(만수동 향촌휴먼시아1단지아파트)","이연규","사",1,"10-07신곡천","4480038034101880000",275,176]
["우안","홍성군","갈산면","운곡리",196,"답",1322,21," 충청남도 홍성군 갈산면 내갈리 316-2","조정행","사",1,"10-07신곡천","4480038034101960000",1349,1301]
["우안","홍성군","갈산면","운곡리",199,"천",750,51,"홍성군 갈산면 운곡리 169","서창석","사",1,"10-07신곡천","4480038034101990000",738,699]
["우안","홍성군","갈산면","운곡리",531,"답",1632,109,"홍성군 갈산면 운곡리  228-2","이용규","사",1,"10-07신곡천","4480038034105310000",1630,1523]
["우안","홍성군","갈산면","운곡리",703,"도",322,19," 국(건설부)","국","국",1,"10-07신곡천","4480038034107030000",300,303]
["우안","홍성군","갈산면","운곡리",750,"제",6334,1," 국(건설부)","국","국",1,"10-07신곡천","4480038034107500000",1257,6333]
["우안","홍성군","갈산면","운곡리",752,"도",98,13," 국(농림수산부)","국","국",1,"10-07신곡천","4480038034107520000",96,85]
["우안","홍성군","갈산면","운곡리",767,"구",620,56," 국(농림수산부)","국","국",1,"10-07신곡천","4480038034107670000",630,564]
["좌안","홍성군","갈산면","운곡리","195-1","대",86,14,"홍성군 갈산면 운곡리  195-1","갈산면운곡리신곡마을회","사",1,"10-07신곡천","4480038034101950001",82,72]
["좌안","홍성군","갈산면","운곡리","198-1",{"$f":"VLOOKUP(N13,#REF!,8,FALSE)","v":{"$error":"#REF!"}},{"$f":"VLOOKUP(N13,#REF!,9,FALSE)","v":{"$error":"#REF!"}},37,{"$f":"VLOOKUP(N13,#REF!,13,FALSE)","v":{"$error":"#REF!"}},{"$f":"VLOOKUP(N13,#REF!,14,FALSE)","v":{"$error":"#REF!"}},"사",1,"10-07신곡천","4480038034101980001",415,{"$error":"#REF!"}]
["좌안","홍성군","갈산면","운곡리","530-1","답",1692,45," 상촌리 240-8","이상호","사",1,"10-07신곡천","4480038034105300001",1679,1647]
["좌안","홍성군","갈산면","운곡리","571-1","답",1866,65,"홍성군 갈산면 운곡리 420","유갑진","사",1,"10-07신곡천","4480038034105710001",1848,1801]
["좌안","홍성군","갈산면","운곡리","572-1","답",3201,17,"홍성군 갈산면 운곡리 626","김철","사",1,"10-07신곡천","4480038034105720001",3203,3184]
["좌안","홍성군","갈산면","운곡리","572-2","답",1410,70,"홍성군 갈산면 운곡리 626","김철","사",1,"10-07신곡천","4480038034105720002",1411,1340]

{"sheet":"예정지지번조서","index":8,"n_rows":11,"n_cols":21,"rows_kept":11,"cut":false,"hidden":false,"merged":[[0,19,0,20],[0,0,1,0],[0,1,0,4],[0,5,1,5],[0,6,1,6],[0,7,1,7],[0,8,0,9],[0,11,1,11],[0,12,0,15],[0,16,1,16],[0,17,1,17],[0,18,1,18]]}
["구역","토지소재지",null,null,null,"지목","지적","편입면적","소  유  자",null,null,"구역","토지소재지",null,null,null,"지목","지적","편입면적","소  유  자"]
[null,"시.군","구.면","동.리","번.지",null,null,null,"주   소","성   명",null,null,"시.군","구.면","동.리","번.지",null,null,null,"주   소","성   명"]
["좌안","홍성군","갈산면","운곡리","703","도",322,19," 국(건설부)","국",null,"우안","홍성군","갈산면","운곡리","195-1","대",86,14,"홍성군 갈산면 운곡리  195-1","갈산면운곡리신곡마을회"]
["좌안","홍성군","갈산면","운곡리","155","답",592,63,"홍성군 갈산면 운곡리 213","이은섭",null,"우안","홍성군","갈산면","운곡리","752","도",98,13," 국(농림수산부)","국"]
["좌안","홍성군","갈산면","운곡리","767","구",620,56," 국(농림수산부)","국",null,"우안","홍성군","갈산면","운곡리","188","전",278,102," 인천광역시 남동구 만수서로 55  137동 1102호(만수동 향촌휴먼시아1단지아파트)","이연규"]
["좌안","홍성군","갈산면","운곡리","531","답",1632,109,"홍성군 갈산면 운곡리  228-2","이용규",null,"우안","홍성군","갈산면","운곡리","198-1"," 답",416,37," 경기도 평택시 지산로 128  102동 302호(지산동 케씨씨스위첸아파트)"," 전부연"]
["좌안","홍성군","갈산면","운곡리","530-1","답",1692,45," 상촌리 240-8","이상호",null,"우안","홍성군","갈산면","운곡리","199","천",750,51,"홍성군 갈산면 운곡리 169","서창석"]
["좌안","홍성군","갈산면","운곡리","750","제",6334,1," 국(건설부)","국",null,"우안","홍성군","갈산면","운곡리","196","답",1322,21," 충청남도 홍성군 갈산면 내갈리 316-2","조정행"]
[null,null,null,null,null,null,null,null,null,null,null,"우안","홍성군","갈산면","운곡리","572-2","답",1410,70,"홍성군 갈산면 운곡리 626","김철"]
[null,null,null,null,null,null,null,null,null,null,null,"우안","홍성군","갈산면","운곡리","571-1","답",1866,65,"홍성군 갈산면 운곡리 420","유갑진"]
[null,null,null,null,null,null,null,null,null,null,null,"우안","홍성군","갈산면","운곡리","572-1","답",3201,17,"홍성군 갈산면 운곡리 626","김철"]

{"sheet":"간지4","index":9,"n_rows":5,"n_cols":1,"rows_kept":5,"cut":false,"hidden":false,"merged":[[4,0,7,7]]}
[]
[]
[]
[]
["예정지 국유지"]

{"sheet":"예정지 국유지 집계","index":10,"n_rows":9,"n_cols":35,"rows_kept":9,"cut":false,"hidden":false,"merged":[[7,1,8,3],[3,5,3,33],[5,0,8,0],[1,0,1,34],[5,1,6,1],[5,2,6,2],[5,3,6,3],[3,0,4,0],[3,1,4,1],[3,2,4,2],[3,3,4,3],[3,34,4,34]]}
[]
["신곡천 예정지 국유지 집계표"]
[]
["하천명","시.군","구.면","읍.리","필지수(EA)","지    목    별    구    분",null,null,null,null,null,null,null,null,null,null,null,null,null,null,null,null,null,null,null,null,null,null,null,null,null,null,null,null,"계"]
[null,null,null,null,"편입면적(m2)","천","전","답","도","대","임","구","제","잡","장","목","과","묘","유","학","철","수","차","창","가","광","염","주","양","공","체","원","종","사"]
["신곡천","홍성군","갈산면","운곡리","필지수",null,null,null,2,null,null,1,1,null,null,null,null,null,null,null,null,null,null,null,null,null,null,null,null,null,null,null,null,null,4]
[null,null,null,null,"편입면적",null,null,null,32,null,null,56,1,null,null,null,null,null,null,null,null,null,null,null,null,null,null,null,null,null,null,null,null,null,89]
[null,"합  계",null,null,"필지수",null,null,null,2,null,null,1,1,null,null,null,null,null,null,null,null,null,null,null,null,null,null,null,null,null,null,null,null,null,4]
[null,null,null,null,"편입면적",null,null,null,32,null,null,56,1,null,null,null,null,null,null,null,null,null,null,null,null,null,null,null,null,null,null,null,null,null,89]

{"sheet":"예정지국유지1열","index":11,"n_rows":6,"n_cols":17,"rows_kept":6,"cut":false,"hidden":true,"merged":[]}
["신곡천"]
["구역","시.군","구.면","동.리","번지","지목","지적","예정지","주소","성명","구분1","구분2","하천명","PNU","전필지면적(m2)","본번","부번"]
["우안","홍성군","갈산면","운곡리",703,"도",322,19," 국(건설부)","국","국",1,"10-07신곡천","4480038034107030000",300,85]
["좌안","홍성군","갈산면","운곡리",750,"제",6334,1," 국(건설부)","국","국",1,"10-07신곡천","4480038034107500000",1257,303]
["좌안","홍성군","갈산면","운곡리",752,"도",98,13," 국(농림수산부)","국","국",1,"10-07신곡천","4480038034107520000",96,564]
["좌안","홍성군","갈산면","운곡리",767,"구",620,56," 국(농림수산부)","국","국",1,"10-07신곡천","4480038034107670000",630,6333]

{"sheet":"예정지국유지지번조서","index":12,"n_rows":5,"n_cols":21,"rows_kept":5,"cut":false,"hidden":false,"merged":[[0,19,0,20],[0,0,1,0],[0,1,0,4],[0,5,1,5],[0,6,1,6],[0,7,1,7],[0,8,0,9],[0,11,1,11],[0,12,0,15],[0,16,1,16],[0,17,1,17],[0,18,1,18]]}
["구역","토지소재지",null,null,null,"지목","지적","편입면적","소  유  자",null,null,"구역","토지소재지",null,null,null,"지목","지적","편입면적","소  유  자"]
[null,"시.군","구.면","동.리","번.지",null,null,null,"주   소","성   명",null,null,"시.군","구.면","동.리","번.지",null,null,null,"주   소","성   명"]
["좌안","홍성군","갈산면","운곡리","703","도",322,19," 국(건설부)","국",null,"우안","홍성군","갈산면","운곡리","752","도",98,13," 국(농림수산부)","국"]
["좌안","홍성군","갈산면","운곡리","767","구",620,56," 국(농림수산부)","국"]
["좌안","홍성군","갈산면","운곡리","750","제",6334,1," 국(건설부)","국"]

{"sheet":"간지5","index":13,"n_rows":5,"n_cols":1,"rows_kept":5,"cut":false,"hidden":false,"merged":[[4,0,7,7]]}
[]
[]
[]
[]
["예정지 사유지"]

{"sheet":"예정지 사유지 집계","index":14,"n_rows":9,"n_cols":35,"rows_kept":9,"cut":false,"hidden":false,"merged":[[7,1,8,3],[3,5,3,33],[5,0,8,0],[1,0,1,34],[5,1,6,1],[5,2,6,2],[5,3,6,3],[3,0,4,0],[3,1,4,1],[3,2,4,2],[3,3,4,3],[3,34,4,34]]}
[]
["신곡천 예정지 사유지 집계표"]
[]
["하천명","시.군","구.면","읍.리","필지수(EA)","지    목    별    구    분",null,null,null,null,null,null,null,null,null,null,null,null,null,null,null,null,null,null,null,null,null,null,null,null,null,null,null,null,"계"]
[null,null,null,null,"편입면적(m2)","천","전","답","도","대","임","구","제","잡","장","목","과","묘","유","학","철","수","차","창","가","광","염","주","양","공","체","원","종","사"]
["신곡천","홍성군","갈산면","운곡리","필지수",1,1,7,null,1,null,null,null,null,null,null,null,null,null,null,null,null,null,null,null,null,null,null,null,null,null,null,null,null,10]
[null,null,null,null,"편입면적",51,102,390,null,14,null,null,null,null,null,null,null,null,null,null,null,null,null,null,null,null,null,null,null,null,null,null,null,null,557]
[null,"합  계",null,null,"필지수",1,1,7,null,1,null,null,null,null,null,null,null,null,null,null,null,null,null,null,null,null,null,null,null,null,null,null,null,null,10]
[null,null,null,null,"편입면적",51,102,390,null,14,null,null,null,null,null,null,null,null,null,null,null,null,null,null,null,null,null,null,null,null,null,null,null,null,557]

{"sheet":"예정지사유지1열","index":15,"n_rows":13,"n_cols":17,"rows_kept":13,"cut":false,"hidden":true,"merged":[]}
["신곡천"]
["구역","시.군","구.면","동.리","번지","지목","지적","예정지","주소","성명","구분1","구분2","하천명","PNU","전필지면적(m2)","본번","부번"]
["우안","홍성군","갈산면","운곡리",155,"답",592,63,"홍성군 갈산면 운곡리 213","이은섭","사",1,"10-07신곡천","4480038034101550000",579,72]
["우안","홍성군","갈산면","운곡리",188,"전",278,102," 인천광역시 남동구 만수서로 55  137동 1102호(만수동 향촌휴먼시아1단지아파트)","이연규","사",1,"10-07신곡천","4480038034101880000",275,176]
["우안","홍성군","갈산면","운곡리",196,"답",1322,21," 충청남도 홍성군 갈산면 내갈리 316-2","조정행","사",1,"10-07신곡천","4480038034101960000",1349,379]
["우안","홍성군","갈산면","운곡리",199,"천",750,51,"홍성군 갈산면 운곡리 169","서창석","사",1,"10-07신곡천","4480038034101990000",738,699]
["우안","홍성군","갈산면","운곡리",531,"답",1632,109,"홍성군 갈산면 운곡리  228-2","이용규","사",1,"10-07신곡천","4480038034105310000",1630,1301]
["우안","홍성군","갈산면","운곡리","195-1","대",86,14,"홍성군 갈산면 운곡리  195-1","갈산면운곡리신곡마을회","사",1,"10-07신곡천","4480038034101950001",82,1340]
["우안","홍성군","갈산면","운곡리","198-1"," 답",416,37," 경기도 평택시 지산로 128  102동 302호(지산동 케씨씨스위첸아파트)"," 전부연","사",1,"10-07신곡천","4480038034101980001",415,1801]
["우안","홍성군","갈산면","운곡리","530-1","답",1692,45," 상촌리 240-8","이상호","사",1,"10-07신곡천","4480038034105300001",1679,3184]
["좌안","홍성군","갈산면","운곡리","571-1","답",1866,65,"홍성군 갈산면 운곡리 420","유갑진","사",1,"10-07신곡천","4480038034105710001",1848,529]
["좌안","홍성군","갈산면","운곡리","572-1","답",3201,17,"홍성군 갈산면 운곡리 626","김철","사",1,"10-07신곡천","4480038034105720001",3203,1523]
["좌안","홍성군","갈산면","운곡리","572-2","답",1410,70,"홍성군 갈산면 운곡리 626","김철","사",1,"10-07신곡천","4480038034105720002",1411,1647]

{"sheet":"예정지사유지지번조서","index":16,"n_rows":10,"n_cols":21,"rows_kept":10,"cut":false,"hidden":false,"merged":[[0,19,0,20],[0,0,1,0],[0,1,0,4],[0,5,1,5],[0,6,1,6],[0,7,1,7],[0,8,0,9],[0,11,1,11],[0,12,0,15],[0,16,1,16],[0,17,1,17],[0,18,1,18]]}
["구역","토지소재지",null,null,null,"지목","지적","편입면적","소  유  자",null,null,"구역","토지소재지",null,null,null,"지목","지적","편입면적","소  유  자"]
[null,"시.군","구.면","동.리","번.지",null,null,null,"주   소","성   명",null,null,"시.군","구.면","동.리","번.지",null,null,null,"주   소","성   명"]
["좌안","홍성군","갈산면","운곡리","155","답",592,63,"홍성군 갈산면 운곡리 213","이은섭",null,"우안","홍성군","갈산면","운곡리","195-1","대",86,14,"홍성군 갈산면 운곡리  195-1","갈산면운곡리신곡마을회"]
["좌안","홍성군","갈산면","운곡리","531","답",1632,109,"홍성군 갈산면 운곡리  228-2","이용규",null,"우안","홍성군","갈산면","운곡리","188","전",278,102," 인천광역시 남동구 만수서로 55  137동 1102호(만수동 향촌휴먼시아1단지아파트)","이연규"]
["좌안","홍성군","갈산면","운곡리","530-1","답",1692,45," 상촌리 240-8","이상호",null,"우안","홍성군","갈산면","운곡리","198-1"," 답",416,37," 경기도 평택시 지산로 128  102동 302호(지산동 케씨씨스위첸아파트)"," 전부연"]
[null,null,null,null,null,null,null,null,null,null,null,"우안","홍성군","갈산면","운곡리","199","천",750,51,"홍성군 갈산면 운곡리 169","서창석"]
[null,null,null,null,null,null,null,null,null,null,null,"우안","홍성군","갈산면","운곡리","196","답",1322,21," 충청남도 홍성군 갈산면 내갈리 316-2","조정행"]
[null,null,null,null,null,null,null,null,null,null,null,"우안","홍성군","갈산면","운곡리","572-2","답",1410,70,"홍성군 갈산면 운곡리 626","김철"]
[null,null,null,null,null,null,null,null,null,null,null,"우안","홍성군","갈산면","운곡리","571-1","답",1866,65,"홍성군 갈산면 운곡리 420","유갑진"]
[null,null,null,null,null,null,null,null,null,null,null,"우안","홍성군","갈산면","운곡리","572-1","답",3201,17,"홍성군 갈산면 운곡리 626","김철"]

{"sheet":"기존폐천1열","index":17,"n_rows":3,"n_cols":17,"rows_kept":3,"cut":false,"hidden":true,"merged":[]}
["신곡천"]
["구역","시.군","구.면","동.리","번지","지목","지적","폐천구역","주소","성명","구분1","구분2","하천명","PNU","전필지면적(m2)","본번","부번"]
[null,null,null,null,null,null,null,null,null,null,null,0]

{"sheet":"홍수관리구역1열","index":18,"n_rows":3,"n_cols":17,"rows_kept":3,"cut":false,"hidden":true,"merged":[]}
["신곡천"]
["구역","시.군","구.면","동.리","번지","지목","지적","홍수관리구역","주소","성명","구분1","구분2","하천명","PNU","전필지면적(m2)","본번","부번"]
[null,null,null,null,null,null,null,null,null,null,"사",0]