{"text_format":"1","workbook":"xlsx","n_sheets":26,"sheets":["검토 시설개요","신설 계획인구 및 계획하수량","경제성검토 총괄","황소","봉곡","운곡","초곡","구야","문무","남곡","던돌마","덕남","대양","옥율","능치","도암","태화","신암","광기","무안","신안","대평","하강","월곡","월매","옥동"],"not_rendered":{"charts":0,"images":69,"macros":1,"external_links":3,"defined_names":89,"comments":0,"pivot_tables":0},"unopened":[],"bounds":{"document_bytes":16777216,"sheet_cells":100000,"rows_first":2000,"rows_last":500,"rows_between":2000,"halvings":0,"cell_chars":16384,"cell_head_chars":4096},"cells_cut":0,"cells_raw":0,"read":"whole","date_system":"1900"}

{"sheet":"검토 시설개요","index":0,"n_rows":26,"n_cols":8,"rows_kept":26,"cut":false,"hidden":false,"merged":[[1,5,1,6],[1,7,2,7],[1,0,2,0],[1,1,2,1],[1,2,2,2],[1,3,1,4]]}
["5.1 소규모 하수도 계획인구 및 계획하수량"]
["시설명","시설용량\n(㎥/일)","세대수\n(세대)","계획인구",null,"계획하수량",null,"관로연장\n(m)"]
[null,null,null,"2020년","2025년","2020년","2025년"]
["황소",{"$f":"VLOOKUP($A4,'신설 계획인구 및 계획하수량'!$A:$I,3,FALSE)","v":60},{"$f":"VLOOKUP($A4,'신설 계획인구 및 계획하수량'!$A:$I,4,FALSE)","v":108},{"$f":"VLOOKUP($A4,'신설 계획인구 및 계획하수량'!$A:$I,5,FALSE)","v":284},{"$f":"VLOOKUP($A4,'신설 계획인구 및 계획하수량'!$A:$I,6,FALSE)","v":282},{"$f":"VLOOKUP($A4,'신설 계획인구 및 계획하수량'!$A:$I,8,FALSE)","v":57},{"$f":"VLOOKUP($A4,'신설 계획인구 및 계획하수량'!$A:$I,9,FALSE)","v":56},2202]
["봉곡",{"$f":"VLOOKUP($A5,'신설 계획인구 및 계획하수량'!$A:$I,3,FALSE)","v":140},{"$f":"VLOOKUP($A5,'신설 계획인구 및 계획하수량'!$A:$I,4,FALSE)","v":311},{"$f":"VLOOKUP($A5,'신설 계획인구 및 계획하수량'!$A:$I,5,FALSE)","v":682},{"$f":"VLOOKUP($A5,'신설 계획인구 및 계획하수량'!$A:$I,6,FALSE)","v":675},{"$f":"VLOOKUP($A5,'신설 계획인구 및 계획하수량'!$A:$I,8,FALSE)","v":137},{"$f":"VLOOKUP($A5,'신설 계획인구 및 계획하수량'!$A:$I,9,FALSE)","v":135},7374]
["운곡",{"$f":"VLOOKUP($A6,'신설 계획인구 및 계획하수량'!$A:$I,3,FALSE)","v":70},{"$f":"VLOOKUP($A6,'신설 계획인구 및 계획하수량'!$A:$I,4,FALSE)","v":152},{"$f":"VLOOKUP($A6,'신설 계획인구 및 계획하수량'!$A:$I,5,FALSE)","v":312},{"$f":"VLOOKUP($A6,'신설 계획인구 및 계획하수량'!$A:$I,6,FALSE)","v":309},{"$f":"VLOOKUP($A6,'신설 계획인구 및 계획하수량'!$A:$I,8,FALSE)","v":62},{"$f":"VLOOKUP($A6,'신설 계획인구 및 계획하수량'!$A:$I,9,FALSE)","v":62},1950]
{"$rows_left_out":21}
{"sheet":"신설 계획인구 및 계획하수량","index":1,"n_rows":96,"n_cols":9,"rows_kept":96,"cut":false,"hidden":false,"merged":[[1,4,1,5],[1,6,2,6],[1,7,1,8],[1,0,2,0],[1,1,2,1],[1,2,2,2],[1,3,2,3]]}
["5.2 소규모 하수도 대상마을 계획인구 및 계획하수량"]
["시설명","마을명","시설용량\n(㎥/일)","세대수\n(세대)","계획인구(인)",null,"생활오수\n원단위\n(Lpcd)","계획하수량(㎥/일)"]
[null,null,null,null,"2020년","2025년",null,"2020년","2025년"]
["황소","고삽",{"$f":"ROUNDUP(I4,-1)","v":60},{"$f":"VLOOKUP($B4,[3]계획인구!$C$1:$AA$65536,12,FALSE)","v":108},{"$f":"VLOOKUP($B4,[3]계획인구!$C$1:$AA$65536,22,FALSE)","v":284},{"$f":"VLOOKUP($B4,[3]계획인구!$C$1:$AA$65536,23,FALSE)","v":282},200,{"$f":"ROUND(E4*$G4/1000,0)","v":57},{"$f":"ROUND(F4*$G4/1000,0)","v":56}]
["봉곡","소  계",{"$f":"ROUNDUP(I5,-1)","v":140},{"$f":"SUM(D6:D9)","v":311},{"$f":"SUM(E6:E9)","v":682},675,null,{"$f":"SUM(H6:H9)","v":137},135]
[null,"씰미",null,{"$f":"VLOOKUP($B6,[3]계획인구!$C$1:$AA$65536,12,FALSE)","v":124},{"$f":"VLOOKUP($B6,[3]계획인구!$C$1:$AA$65536,22,FALSE)","v":264},{"$f":"VLOOKUP($B6,[3]계획인구!$C$1:$AA$65536,23,FALSE)","v":262},200,{"$f":"ROUND(E6*$G6/1000,0)","v":53},{"$f":"ROUND(F6*$G6/1000,0)","v":52}]
{"$rows_left_out":91}
{"sheet":"경제성검토 총괄","index":2,"n_rows":96,"n_cols":7,"rows_kept":96,"cut":false,"hidden":false,"merged":[[1,0,3,0],[1,1,3,1],[1,2,1,5],[1,6,3,6],[2,2,2,3],[2,4,2,5],[15,2,15,3],[15,4,15,5],[10,2,10,3],[10,4,10,5],[11,2,11,3],[11,4,11,5],[4,0,7,0],[6,2,6,3],[6,4,6,5],[7,2,7,3],[7,4,7,5],[8,0,11,0],[12,0,15,0],[14,2,14,3],[14,4,14,5],[20,0,23,0],[22,2,22,3],[22,4,22,5],[23,2,23,3],[23,4,23,5],[27,2,27,3],[27,4,27,5],[16,0,19,0],[19,2,19,3],[19,4,19,5],[18,2,18,3],[18,4,18,5],[30,2,30,3],[30,4,30,5],[24,0,27,0],[26,2,26,3],[26,4,26,5],[28,0,31,0],[31,2,31,3],[31,4,31,5],[34,2,34,3],[34,4,34,5],[35,2,35,3],[35,4,35,5],[36,0,39,0],[38,2,38,3],[38,4,38,5],[39,2,39,3],[39,4,39,5],[32,0,35,0],[58,2,58,3],[58,4,58,5],[52,0,55,0],[54,2,54,3],[54,4,54,5],[56,0,59,0],[59,2,59,3],[59,4,59,5],[46,4,46,5],[48,0,51,0],[50,2,50,3],[50,4,50,5],[51,2,51,3],[51,4,51,5],[47,2,47,3],[47,4,47,5],[67,2,67,3],[67,4,67,5],[55,2,55,3],[55,4,55,5],[60,0,63,0],[62,2,62,3],[62,4,62,5],[63,2,63,3],[63,4,63,5],[64,0,67,0],[66,2,66,3],[66,4,66,5],[40,0,43,0],[42,2,42,3],[42,4,42,5],[43,2,43,3],[43,4,43,5],[44,0,47,0],[46,2,46,3],[76,6,79,6],[80,6,83,6],[68,0,71,0],[70,2,70,3],[70,4,70,5],[71,2,71,3],[71,4,71,5],[72,0,75,0],[74,2,74,3],[74,4,74,5],[75,2,75,3],[75,4,75,5],[68,6,71,6],[72,6,75,6],[76,0,79,0],[78,2,78,3],[78,4,78,5],[79,2,79,3],[79,4,79,5],[80,0,83,0],[82,2,82,3],[82,4,82,5],[83,2,83,3],[83,4,83,5],[92,0,95,0],[94,2,94,3],[94,4,94,5],[95,2,95,3],[95,4,95,5],[92,6,95,6],[84,0,87,0],[86,2,86,3],[86,4,86,5],[87,2,87,3],[87,4,87,5],[88,0,91,0],[90,2,90,3],[90,4,90,5],[91,2,91,3],[91,4,91,5],[84,6,87,6],[88,6,91,6],[40,6,43,6],[44,6,47,6],[48,6,51,6],[52,6,55,6],[56,6,59,6],[60,6,63,6],[64,6,67,6],[4,6,7,6],[8,6,11,6],[12,6,15,6],[16,6,19,6],[20,6,23,6],[24,6,27,6],[28,6,31,6],[32,6,35,6],[36,6,39,6]]}
["5.3 소규모 하수도 경제성 평가결과"]
["시설명","구 분","처리 비용 (현재가치) (단위: 백만원)",null,null,null,"비 고"]
[null,null,"개별처리",null,"집합처리"]
[null,null,"건설비","유지관리비","건설비","유지관리비"]
["황소","처리시설",{"$f":"황소!$B$49","v":1069.955078125},{"$f":"황소!$C$49","v":2056.630615234375},{"$f":"황소!$D$49","v":978.8519287109375},{"$f":"황소!$E$49","v":278.17498779296875}]
[null,"관거",null,null,{"$f":"황소!$D$50","v":1253.044189453125},{"$f":"황소!$E$50","v":194.73255920410156}]
{"$rows_left_out":91}
{"sheet":"황소","index":3,"n_rows":54,"n_cols":11,"rows_kept":54,"cut":false,"hidden":false,"merged":[[19,0,19,6],[0,0,0,6],[1,0,1,6],[2,0,2,6],[4,0,4,6],[6,0,6,6],[8,0,8,6],[10,0,10,6],[12,0,12,6],[13,0,13,6],[15,0,15,6],[17,0,17,6],[41,0,41,2],[21,0,21,6],[23,0,23,6],[24,0,24,6],[25,0,25,6],[27,0,27,6],[29,0,29,6],[31,0,31,6],[33,0,33,6],[35,0,35,6],[37,0,37,6],[39,0,39,6],[51,1,51,4],[52,1,52,4],[53,1,53,4],[45,0,47,0],[45,1,45,4],[46,1,46,2],[46,3,46,4],[50,1,50,2],[50,3,50,4]]}
["경제성 평가 일반 - 집합처리와 개별처리의 비교",null,null,null,null,null,null,null,"황소"]
["개요: 하수처리구역 설정 시 처리구역으로 설정하여 집합처리하는 것과, 처리구역으로 설정하지 않고 개별처리하는 것이 어느 것이 더 경제적인가? "]
["※아래 질문에 대한 답을 오른쪽 노란 칸에 적어 주십시오. 질문에 대한 답을 하실 수 없는 경우에는 파란색 빈칸에 있는 숫자를 노란색 칸에 적어 주십시오"]
[]
["1. 하수처리구역의 목표 BOD를 선택해 주십시오."]
[]
{"$rows_left_out":49}
{"sheet":"봉곡","index":4,"n_rows":54,"n_cols":11,"rows_kept":54,"cut":false,"hidden":false,"merged":[[19,0,19,6],[0,0,0,6],[1,0,1,6],[2,0,2,6],[4,0,4,6],[6,0,6,6],[8,0,8,6],[10,0,10,6],[12,0,12,6],[13,0,13,6],[15,0,15,6],[17,0,17,6],[41,0,41,2],[21,0,21,6],[23,0,23,6],[24,0,24,6],[25,0,25,6],[27,0,27,6],[29,0,29,6],[31,0,31,6],[33,0,33,6],[35,0,35,6],[37,0,37,6],[39,0,39,6],[51,1,51,4],[52,1,52,4],[53,1,53,4],[45,0,47,0],[45,1,45,4],[46,1,46,2],[46,3,46,4],[50,1,50,2],[50,3,50,4]]}
["경제성 평가 일반 - 집합처리와 개별처리의 비교",null,null,null,null,null,null,null,"봉곡"]
["개요: 하수처리구역 설정 시 처리구역으로 설정하여 집합처리하는 것과, 처리구역으로 설정하지 않고 개별처리하는 것이 어느 것이 더 경제적인가? "]
["※아래 질문에 대한 답을 오른쪽 노란 칸에 적어 주십시오. 질문에 대한 답을 하실 수 없는 경우에는 파란색 빈칸에 있는 숫자를 노란색 칸에 적어 주십시오"]
[]
["1. 하수처리구역의 목표 BOD를 선택해 주십시오."]
[]
{"$rows_left_out":49}
{"sheet":"운곡","index":5,"n_rows":54,"n_cols":11,"rows_kept":54,"cut":false,"hidden":false,"merged":[[19,0,19,6],[0,0,0,6],[1,0,1,6],[2,0,2,6],[4,0,4,6],[6,0,6,6],[8,0,8,6],[10,0,10,6],[12,0,12,6],[13,0,13,6],[15,0,15,6],[17,0,17,6],[41,0,41,2],[21,0,21,6],[23,0,23,6],[24,0,24,6],[25,0,25,6],[27,0,27,6],[29,0,29,6],[31,0,31,6],[33,0,33,6],[35,0,35,6],[37,0,37,6],[39,0,39,6],[51,1,51,4],[52,1,52,4],[53,1,53,4],[45,0,47,0],[45,1,45,4],[46,1,46,2],[46,3,46,4],[50,1,50,2],[50,3,50,4]]}
["경제성 평가 일반 - 집합처리와 개별처리의 비교",null,null,null,null,null,null,null,"운곡"]
["개요: 하수처리구역 설정 시 처리구역으로 설정하여 집합처리하는 것과, 처리구역으로 설정하지 않고 개별처리하는 것이 어느 것이 더 경제적인가? "]
["※아래 질문에 대한 답을 오른쪽 노란 칸에 적어 주십시오. 질문에 대한 답을 하실 수 없는 경우에는 파란색 빈칸에 있는 숫자를 노란색 칸에 적어 주십시오"]
[]
["1. 하수처리구역의 목표 BOD를 선택해 주십시오."]
[]
{"$rows_left_out":49}
{"sheet":"초곡","index":6,"n_rows":54,"n_cols":11,"rows_kept":54,"cut":false,"hidden":false,"merged":[[19,0,19,6],[0,0,0,6],[1,0,1,6],[2,0,2,6],[4,0,4,6],[6,0,6,6],[8,0,8,6],[10,0,10,6],[12,0,12,6],[13,0,13,6],[15,0,15,6],[17,0,17,6],[41,0,41,2],[21,0,21,6],[23,0,23,6],[24,0,24,6],[25,0,25,6],[27,0,27,6],[29,0,29,6],[31,0,31,6],[33,0,33,6],[35,0,35,6],[37,0,37,6],[39,0,39,6],[51,1,51,4],[52,1,52,4],[53,1,53,4],[45,0,47,0],[45,1,45,4],[46,1,46,2],[46,3,46,4],[50,1,50,2],[50,3,50,4]]}
["경제성 평가 일반 - 집합처리와 개별처리의 비교",null,null,null,null,null,null,null,"초곡"]
["개요: 하수처리구역 설정 시 처리구역으로 설정하여 집합처리하는 것과, 처리구역으로 설정하지 않고 개별처리하는 것이 어느 것이 더 경제적인가? "]
["※아래 질문에 대한 답을 오른쪽 노란 칸에 적어 주십시오. 질문에 대한 답을 하실 수 없는 경우에는 파란색 빈칸에 있는 숫자를 노란색 칸에 적어 주십시오"]
[]
["1. 하수처리구역의 목표 BOD를 선택해 주십시오."]
[]
{"$rows_left_out":49}
{"sheet":"구야","index":7,"n_rows":54,"n_cols":11,"rows_kept":54,"cut":false,"hidden":false,"merged":[[19,0,19,6],[0,0,0,6],[1,0,1,6],[2,0,2,6],[4,0,4,6],[6,0,6,6],[8,0,8,6],[10,0,10,6],[12,0,12,6],[13,0,13,6],[15,0,15,6],[17,0,17,6],[41,0,41,2],[21,0,21,6],[23,0,23,6],[24,0,24,6],[25,0,25,6],[27,0,27,6],[29,0,29,6],[31,0,31,6],[33,0,33,6],[35,0,35,6],[37,0,37,6],[39,0,39,6],[51,1,51,4],[52,1,52,4],[53,1,53,4],[45,0,47,0],[45,1,45,4],[46,1,46,2],[46,3,46,4],[50,1,50,2],[50,3,50,4]]}
["경제성 평가 일반 - 집합처리와 개별처리의 비교",null,null,null,null,null,null,null,"구야"]
["개요: 하수처리구역 설정 시 처리구역으로 설정하여 집합처리하는 것과, 처리구역으로 설정하지 않고 개별처리하는 것이 어느 것이 더 경제적인가? "]
["※아래 질문에 대한 답을 오른쪽 노란 칸에 적어 주십시오. 질문에 대한 답을 하실 수 없는 경우에는 파란색 빈칸에 있는 숫자를 노란색 칸에 적어 주십시오"]
[]
["1. 하수처리구역의 목표 BOD를 선택해 주십시오."]
[]
{"$rows_left_out":49}
{"sheet":"문무","index":8,"n_rows":54,"n_cols":11,"rows_kept":54,"cut":false,"hidden":false,"merged":[[19,0,19,6],[0,0,0,6],[1,0,1,6],[2,0,2,6],[4,0,4,6],[6,0,6,6],[8,0,8,6],[10,0,10,6],[12,0,12,6],[13,0,13,6],[15,0,15,6],[17,0,17,6],[41,0,41,2],[21,0,21,6],[23,0,23,6],[24,0,24,6],[25,0,25,6],[27,0,27,6],[29,0,29,6],[31,0,31,6],[33,0,33,6],[35,0,35,6],[37,0,37,6],[39,0,39,6],[51,1,51,4],[52,1,52,4],[53,1,53,4],[45,0,47,0],[45,1,45,4],[46,1,46,2],[46,3,46,4],[50,1,50,2],[50,3,50,4]]}
["경제성 평가 일반 - 집합처리와 개별처리의 비교",null,null,null,null,null,null,null,"문무"]
["개요: 하수처리구역 설정 시 처리구역으로 설정하여 집합처리하는 것과, 처리구역으로 설정하지 않고 개별처리하는 것이 어느 것이 더 경제적인가? "]
["※아래 질문에 대한 답을 오른쪽 노란 칸에 적어 주십시오. 질문에 대한 답을 하실 수 없는 경우에는 파란색 빈칸에 있는 숫자를 노란색 칸에 적어 주십시오"]
[]
["1. 하수처리구역의 목표 BOD를 선택해 주십시오."]
[]
{"$rows_left_out":49}
{"sheet":"남곡","index":9,"n_rows":54,"n_cols":11,"rows_kept":54,"cut":false,"hidden":false,"merged":[[19,0,19,6],[0,0,0,6],[1,0,1,6],[2,0,2,6],[4,0,4,6],[6,0,6,6],[8,0,8,6],[10,0,10,6],[12,0,12,6],[13,0,13,6],[15,0,15,6],[17,0,17,6],[41,0,41,2],[21,0,21,6],[23,0,23,6],[24,0,24,6],[25,0,25,6],[27,0,27,6],[29,0,29,6],[31,0,31,6],[33,0,33,6],[35,0,35,6],[37,0,37,6],[39,0,39,6],[51,1,51,4],[52,1,52,4],[53,1,53,4],[45,0,47,0],[45,1,45,4],[46,1,46,2],[46,3,46,4],[50,1,50,2],[50,3,50,4]]}
["경제성 평가 일반 - 집합처리와 개별처리의 비교",null,null,null,null,null,null,null,"남곡"]
["개요: 하수처리구역 설정 시 처리구역으로 설정하여 집합처리하는 것과, 처리구역으로 설정하지 않고 개별처리하는 것이 어느 것이 더 경제적인가? "]
["※아래 질문에 대한 답을 오른쪽 노란 칸에 적어 주십시오. 질문에 대한 답을 하실 수 없는 경우에는 파란색 빈칸에 있는 숫자를 노란색 칸에 적어 주십시오"]
[]
["1. 하수처리구역의 목표 BOD를 선택해 주십시오."]
[]
{"$rows_left_out":49}
{"sheet":"던돌마","index":10,"n_rows":54,"n_cols":11,"rows_kept":54,"cut":false,"hidden":false,"merged":[[19,0,19,6],[0,0,0,6],[1,0,1,6],[2,0,2,6],[4,0,4,6],[6,0,6,6],[8,0,8,6],[10,0,10,6],[12,0,12,6],[13,0,13,6],[15,0,15,6],[17,0,17,6],[41,0,41,2],[21,0,21,6],[23,0,23,6],[24,0,24,6],[25,0,25,6],[27,0,27,6],[29,0,29,6],[31,0,31,6],[33,0,33,6],[35,0,35,6],[37,0,37,6],[39,0,39,6],[51,1,51,4],[52,1,52,4],[53,1,53,4],[45,0,47,0],[45,1,45,4],[46,1,46,2],[46,3,46,4],[50,1,50,2],[50,3,50,4]]}
["경제성 평가 일반 - 집합처리와 개별처리의 비교",null,null,null,null,null,null,null,"던돌마"]
["개요: 하수처리구역 설정 시 처리구역으로 설정하여 집합처리하는 것과, 처리구역으로 설정하지 않고 개별처리하는 것이 어느 것이 더 경제적인가? "]
["※아래 질문에 대한 답을 오른쪽 노란 칸에 적어 주십시오. 질문에 대한 답을 하실 수 없는 경우에는 파란색 빈칸에 있는 숫자를 노란색 칸에 적어 주십시오"]
[]
["1. 하수처리구역의 목표 BOD를 선택해 주십시오."]
[]
{"$rows_left_out":49}
{"sheet":"덕남","index":11,"n_rows":54,"n_cols":11,"rows_kept":54,"cut":false,"hidden":false,"merged":[[19,0,19,6],[0,0,0,6],[1,0,1,6],[2,0,2,6],[4,0,4,6],[6,0,6,6],[8,0,8,6],[10,0,10,6],[12,0,12,6],[13,0,13,6],[15,0,15,6],[17,0,17,6],[41,0,41,2],[21,0,21,6],[23,0,23,6],[24,0,24,6],[25,0,25,6],[27,0,27,6],[29,0,29,6],[31,0,31,6],[33,0,33,6],[35,0,35,6],[37,0,37,6],[39,0,39,6],[51,1,51,4],[52,1,52,4],[53,1,53,4],[45,0,47,0],[45,1,45,4],[46,1,46,2],[46,3,46,4],[50,1,50,2],[50,3,50,4]]}
["경제성 평가 일반 - 집합처리와 개별처리의 비교",null,null,null,null,null,null,null,"덕남"]
["개요: 하수처리구역 설정 시 처리구역으로 설정하여 집합처리하는 것과, 처리구역으로 설정하지 않고 개별처리하는 것이 어느 것이 더 경제적인가? "]
["※아래 질문에 대한 답을 오른쪽 노란 칸에 적어 주십시오. 질문에 대한 답을 하실 수 없는 경우에는 파란색 빈칸에 있는 숫자를 노란색 칸에 적어 주십시오"]
[]
["1. 하수처리구역의 목표 BOD를 선택해 주십시오."]
[]
{"$rows_left_out":49}
{"sheet":"대양","index":12,"n_rows":54,"n_cols":11,"rows_kept":54,"cut":false,"hidden":false,"merged":[[19,0,19,6],[0,0,0,6],[1,0,1,6],[2,0,2,6],[4,0,4,6],[6,0,6,6],[8,0,8,6],[10,0,10,6],[12,0,12,6],[13,0,13,6],[15,0,15,6],[17,0,17,6],[41,0,41,2],[21,0,21,6],[23,0,23,6],[24,0,24,6],[25,0,25,6],[27,0,27,6],[29,0,29,6],[31,0,31,6],[33,0,33,6],[35,0,35,6],[37,0,37,6],[39,0,39,6],[51,1,51,4],[52,1,52,4],[53,1,53,4],[45,0,47,0],[45,1,45,4],[46,1,46,2],[46,3,46,4],[50,1,50,2],[50,3,50,4]]}
["경제성 평가 일반 - 집합처리와 개별처리의 비교",null,null,null,null,null,null,null,"대양"]
["개요: 하수처리구역 설정 시 처리구역으로 설정하여 집합처리하는 것과, 처리구역으로 설정하지 않고 개별처리하는 것이 어느 것이 더 경제적인가? "]
["※아래 질문에 대한 답을 오른쪽 노란 칸에 적어 주십시오. 질문에 대한 답을 하실 수 없는 경우에는 파란색 빈칸에 있는 숫자를 노란색 칸에 적어 주십시오"]
[]
["1. 하수처리구역의 목표 BOD를 선택해 주십시오."]
[]
{"$rows_left_out":49}
{"sheet":"옥율","index":13,"n_rows":54,"n_cols":11,"rows_kept":54,"cut":false,"hidden":false,"merged":[[19,0,19,6],[0,0,0,6],[1,0,1,6],[2,0,2,6],[4,0,4,6],[6,0,6,6],[8,0,8,6],[10,0,10,6],[12,0,12,6],[13,0,13,6],[15,0,15,6],[17,0,17,6],[41,0,41,2],[21,0,21,6],[23,0,23,6],[24,0,24,6],[25,0,25,6],[27,0,27,6],[29,0,29,6],[31,0,31,6],[33,0,33,6],[35,0,35,6],[37,0,37,6],[39,0,39,6],[51,1,51,4],[52,1,52,4],[53,1,53,4],[45,0,47,0],[45,1,45,4],[46,1,46,2],[46,3,46,4],[50,1,50,2],[50,3,50,4]]}
["경제성 평가 일반 - 집합처리와 개별처리의 비교",null,null,null,null,null,null,null,"옥율"]
["개요: 하수처리구역 설정 시 처리구역으로 설정하여 집합처리하는 것과, 처리구역으로 설정하지 않고 개별처리하는 것이 어느 것이 더 경제적인가? "]
["※아래 질문에 대한 답을 오른쪽 노란 칸에 적어 주십시오. 질문에 대한 답을 하실 수 없는 경우에는 파란색 빈칸에 있는 숫자를 노란색 칸에 적어 주십시오"]
[]
["1. 하수처리구역의 목표 BOD를 선택해 주십시오."]
[]
{"$rows_left_out":49}
{"sheet":"능치","index":14,"n_rows":54,"n_cols":11,"rows_kept":54,"cut":false,"hidden":false,"merged":[[19,0,19,6],[0,0,0,6],[1,0,1,6],[2,0,2,6],[4,0,4,6],[6,0,6,6],[8,0,8,6],[10,0,10,6],[12,0,12,6],[13,0,13,6],[15,0,15,6],[17,0,17,6],[41,0,41,2],[21,0,21,6],[23,0,23,6],[24,0,24,6],[25,0,25,6],[27,0,27,6],[29,0,29,6],[31,0,31,6],[33,0,33,6],[35,0,35,6],[37,0,37,6],[39,0,39,6],[51,1,51,4],[52,1,52,4],[53,1,53,4],[45,0,47,0],[45,1,45,4],[46,1,46,2],[46,3,46,4],[50,1,50,2],[50,3,50,4]]}
["경제성 평가 일반 - 집합처리와 개별처리의 비교",null,null,null,null,null,null,null,"능치"]
["개요: 하수처리구역 설정 시 처리구역으로 설정하여 집합처리하는 것과, 처리구역으로 설정하지 않고 개별처리하는 것이 어느 것이 더 경제적인가? "]
["※아래 질문에 대한 답을 오른쪽 노란 칸에 적어 주십시오. 질문에 대한 답을 하실 수 없는 경우에는 파란색 빈칸에 있는 숫자를 노란색 칸에 적어 주십시오"]
[]
["1. 하수처리구역의 목표 BOD를 선택해 주십시오."]
[]
{"$rows_left_out":49}
{"sheet":"도암","index":15,"n_rows":54,"n_cols":11,"rows_kept":54,"cut":false,"hidden":false,"merged":[[19,0,19,6],[0,0,0,6],[1,0,1,6],[2,0,2,6],[4,0,4,6],[6,0,6,6],[8,0,8,6],[10,0,10,6],[12,0,12,6],[13,0,13,6],[15,0,15,6],[17,0,17,6],[41,0,41,2],[21,0,21,6],[23,0,23,6],[24,0,24,6],[25,0,25,6],[27,0,27,6],[29,0,29,6],[31,0,31,6],[33,0,33,6],[35,0,35,6],[37,0,37,6],[39,0,39,6],[51,1,51,4],[52,1,52,4],[53,1,53,4],[45,0,47,0],[45,1,45,4],[46,1,46,2],[46,3,46,4],[50,1,50,2],[50,3,50,4]]}
["경제성 평가 일반 - 집합처리와 개별처리의 비교",null,null,null,null,null,null,null,"도암"]
["개요: 하수처리구역 설정 시 처리구역으로 설정하여 집합처리하는 것과, 처리구역으로 설정하지 않고 개별처리하는 것이 어느 것이 더 경제적인가? "]
["※아래 질문에 대한 답을 오른쪽 노란 칸에 적어 주십시오. 질문에 대한 답을 하실 수 없는 경우에는 파란색 빈칸에 있는 숫자를 노란색 칸에 적어 주십시오"]
[]
["1. 하수처리구역의 목표 BOD를 선택해 주십시오."]
[]
{"$rows_left_out":49}
{"sheet":"태화","index":16,"n_rows":54,"n_cols":11,"rows_kept":54,"cut":false,"hidden":false,"merged":[[19,0,19,6],[0,0,0,6],[1,0,1,6],[2,0,2,6],[4,0,4,6],[6,0,6,6],[8,0,8,6],[10,0,10,6],[12,0,12,6],[13,0,13,6],[15,0,15,6],[17,0,17,6],[41,0,41,2],[21,0,21,6],[23,0,23,6],[24,0,24,6],[25,0,25,6],[27,0,27,6],[29,0,29,6],[31,0,31,6],[33,0,33,6],[35,0,35,6],[37,0,37,6],[39,0,39,6],[51,1,51,4],[52,1,52,4],[53,1,53,4],[45,0,47,0],[45,1,45,4],[46,1,46,2],[46,3,46,4],[50,1,50,2],[50,3,50,4]]}
["경제성 평가 일반 - 집합처리와 개별처리의 비교",null,null,null,null,null,null,null,"태화"]
["개요: 하수처리구역 설정 시 처리구역으로 설정하여 집합처리하는 것과, 처리구역으로 설정하지 않고 개별처리하는 것이 어느 것이 더 경제적인가? "]
["※아래 질문에 대한 답을 오른쪽 노란 칸에 적어 주십시오. 질문에 대한 답을 하실 수 없는 경우에는 파란색 빈칸에 있는 숫자를 노란색 칸에 적어 주십시오"]
[]
["1. 하수처리구역의 목표 BOD를 선택해 주십시오."]
[]
{"$rows_left_out":49}
{"sheet":"신암","index":17,"n_rows":54,"n_cols":11,"rows_kept":54,"cut":false,"hidden":false,"merged":[[19,0,19,6],[0,0,0,6],[1,0,1,6],[2,0,2,6],[4,0,4,6],[6,0,6,6],[8,0,8,6],[10,0,10,6],[12,0,12,6],[13,0,13,6],[15,0,15,6],[17,0,17,6],[41,0,41,2],[21,0,21,6],[23,0,23,6],[24,0,24,6],[25,0,25,6],[27,0,27,6],[29,0,29,6],[31,0,31,6],[33,0,33,6],[35,0,35,6],[37,0,37,6],[39,0,39,6],[51,1,51,4],[52,1,52,4],[53,1,53,4],[45,0,47,0],[45,1,45,4],[46,1,46,2],[46,3,46,4],[50,1,50,2],[50,3,50,4]]}
["경제성 평가 일반 - 집합처리와 개별처리의 비교",null,null,null,null,null,null,null,"신암"]
["개요: 하수처리구역 설정 시 처리구역으로 설정하여 집합처리하는 것과, 처리구역으로 설정하지 않고 개별처리하는 것이 어느 것이 더 경제적인가? "]
["※아래 질문에 대한 답을 오른쪽 노란 칸에 적어 주십시오. 질문에 대한 답을 하실 수 없는 경우에는 파란색 빈칸에 있는 숫자를 노란색 칸에 적어 주십시오"]
[]
["1. 하수처리구역의 목표 BOD를 선택해 주십시오."]
[]
{"$rows_left_out":49}
{"sheet":"광기","index":18,"n_rows":54,"n_cols":11,"rows_kept":54,"cut":false,"hidden":false,"merged":[[19,0,19,6],[0,0,0,6],[1,0,1,6],[2,0,2,6],[4,0,4,6],[6,0,6,6],[8,0,8,6],[10,0,10,6],[12,0,12,6],[13,0,13,6],[15,0,15,6],[17,0,17,6],[41,0,41,2],[21,0,21,6],[23,0,23,6],[24,0,24,6],[25,0,25,6],[27,0,27,6],[29,0,29,6],[31,0,31,6],[33,0,33,6],[35,0,35,6],[37,0,37,6],[39,0,39,6],[51,1,51,4],[52,1,52,4],[53,1,53,4],[45,0,47,0],[45,1,45,4],[46,1,46,2],[46,3,46,4],[50,1,50,2],[50,3,50,4]]}
["경제성 평가 일반 - 집합처리와 개별처리의 비교",null,null,null,null,null,null,null,"광기"]
["개요: 하수처리구역 설정 시 처리구역으로 설정하여 집합처리하는 것과, 처리구역으로 설정하지 않고 개별처리하는 것이 어느 것이 더 경제적인가? "]
["※아래 질문에 대한 답을 오른쪽 노란 칸에 적어 주십시오. 질문에 대한 답을 하실 수 없는 경우에는 파란색 빈칸에 있는 숫자를 노란색 칸에 적어 주십시오"]
[]
["1. 하수처리구역의 목표 BOD를 선택해 주십시오."]
[]
{"$rows_left_out":49}
{"sheet":"무안","index":19,"n_rows":54,"n_cols":11,"rows_kept":54,"cut":false,"hidden":false,"merged":[[19,0,19,6],[0,0,0,6],[1,0,1,6],[2,0,2,6],[4,0,4,6],[6,0,6,6],[8,0,8,6],[10,0,10,6],[12,0,12,6],[13,0,13,6],[15,0,15,6],[17,0,17,6],[41,0,41,2],[21,0,21,6],[23,0,23,6],[24,0,24,6],[25,0,25,6],[27,0,27,6],[29,0,29,6],[31,0,31,6],[33,0,33,6],[35,0,35,6],[37,0,37,6],[39,0,39,6],[51,1,51,4],[52,1,52,4],[53,1,53,4],[45,0,47,0],[45,1,45,4],[46,1,46,2],[46,3,46,4],[50,1,50,2],[50,3,50,4]]}
["경제성 평가 일반 - 집합처리와 개별처리의 비교",null,null,null,null,null,null,null,"무안"]
["개요: 하수처리구역 설정 시 처리구역으로 설정하여 집합처리하는 것과, 처리구역으로 설정하지 않고 개별처리하는 것이 어느 것이 더 경제적인가? "]
["※아래 질문에 대한 답을 오른쪽 노란 칸에 적어 주십시오. 질문에 대한 답을 하실 수 없는 경우에는 파란색 빈칸에 있는 숫자를 노란색 칸에 적어 주십시오"]
[]
["1. 하수처리구역의 목표 BOD를 선택해 주십시오."]
[]
{"$rows_left_out":49}
{"sheet":"신안","index":20,"n_rows":54,"n_cols":11,"rows_kept":54,"cut":false,"hidden":false,"merged":[[19,0,19,6],[0,0,0,6],[1,0,1,6],[2,0,2,6],[4,0,4,6],[6,0,6,6],[8,0,8,6],[10,0,10,6],[12,0,12,6],[13,0,13,6],[15,0,15,6],[17,0,17,6],[41,0,41,2],[21,0,21,6],[23,0,23,6],[24,0,24,6],[25,0,25,6],[27,0,27,6],[29,0,29,6],[31,0,31,6],[33,0,33,6],[35,0,35,6],[37,0,37,6],[39,0,39,6],[51,1,51,4],[52,1,52,4],[53,1,53,4],[45,0,47,0],[45,1,45,4],[46,1,46,2],[46,3,46,4],[50,1,50,2],[50,3,50,4]]}
["경제성 평가 일반 - 집합처리와 개별처리의 비교",null,null,null,null,null,null,null,"신안"]
["개요: 하수처리구역 설정 시 처리구역으로 설정하여 집합처리하는 것과, 처리구역으로 설정하지 않고 개별처리하는 것이 어느 것이 더 경제적인가? "]
["※아래 질문에 대한 답을 오른쪽 노란 칸에 적어 주십시오. 질문에 대한 답을 하실 수 없는 경우에는 파란색 빈칸에 있는 숫자를 노란색 칸에 적어 주십시오"]
[]
["1. 하수처리구역의 목표 BOD를 선택해 주십시오."]
[]
{"$rows_left_out":49}
{"sheet":"대평","index":21,"n_rows":54,"n_cols":11,"rows_kept":54,"cut":false,"hidden":false,"merged":[[19,0,19,6],[0,0,0,6],[1,0,1,6],[2,0,2,6],[4,0,4,6],[6,0,6,6],[8,0,8,6],[10,0,10,6],[12,0,12,6],[13,0,13,6],[15,0,15,6],[17,0,17,6],[41,0,41,2],[21,0,21,6],[23,0,23,6],[24,0,24,6],[25,0,25,6],[27,0,27,6],[29,0,29,6],[31,0,31,6],[33,0,33,6],[35,0,35,6],[37,0,37,6],[39,0,39,6],[51,1,51,4],[52,1,52,4],[53,1,53,4],[45,0,47,0],[45,1,45,4],[46,1,46,2],[46,3,46,4],[50,1,50,2],[50,3,50,4]]}
["경제성 평가 일반 - 집합처리와 개별처리의 비교",null,null,null,null,null,null,null,"대평"]
["개요: 하수처리구역 설정 시 처리구역으로 설정하여 집합처리하는 것과, 처리구역으로 설정하지 않고 개별처리하는 것이 어느 것이 더 경제적인가? "]
["※아래 질문에 대한 답을 오른쪽 노란 칸에 적어 주십시오. 질문에 대한 답을 하실 수 없는 경우에는 파란색 빈칸에 있는 숫자를 노란색 칸에 적어 주십시오"]
[]
["1. 하수처리구역의 목표 BOD를 선택해 주십시오."]
[]
{"$rows_left_out":49}
{"sheet":"하강","index":22,"n_rows":54,"n_cols":11,"rows_kept":54,"cut":false,"hidden":false,"merged":[[19,0,19,6],[0,0,0,6],[1,0,1,6],[2,0,2,6],[4,0,4,6],[6,0,6,6],[8,0,8,6],[10,0,10,6],[12,0,12,6],[13,0,13,6],[15,0,15,6],[17,0,17,6],[41,0,41,2],[21,0,21,6],[23,0,23,6],[24,0,24,6],[25,0,25,6],[27,0,27,6],[29,0,29,6],[31,0,31,6],[33,0,33,6],[35,0,35,6],[37,0,37,6],[39,0,39,6],[51,1,51,4],[52,1,52,4],[53,1,53,4],[45,0,47,0],[45,1,45,4],[46,1,46,2],[46,3,46,4],[50,1,50,2],[50,3,50,4]]}
["경제성 평가 일반 - 집합처리와 개별처리의 비교",null,null,null,null,null,null,null,"하강"]
["개요: 하수처리구역 설정 시 처리구역으로 설정하여 집합처리하는 것과, 처리구역으로 설정하지 않고 개별처리하는 것이 어느 것이 더 경제적인가? "]
["※아래 질문에 대한 답을 오른쪽 노란 칸에 적어 주십시오. 질문에 대한 답을 하실 수 없는 경우에는 파란색 빈칸에 있는 숫자를 노란색 칸에 적어 주십시오"]
[]
["1. 하수처리구역의 목표 BOD를 선택해 주십시오."]
[]
{"$rows_left_out":49}
{"sheet":"월곡","index":23,"n_rows":54,"n_cols":11,"rows_kept":54,"cut":false,"hidden":false,"merged":[[19,0,19,6],[0,0,0,6],[1,0,1,6],[2,0,2,6],[4,0,4,6],[6,0,6,6],[8,0,8,6],[10,0,10,6],[12,0,12,6],[13,0,13,6],[15,0,15,6],[17,0,17,6],[41,0,41,2],[21,0,21,6],[23,0,23,6],[24,0,24,6],[25,0,25,6],[27,0,27,6],[29,0,29,6],[31,0,31,6],[33,0,33,6],[35,0,35,6],[37,0,37,6],[39,0,39,6],[51,1,51,4],[52,1,52,4],[53,1,53,4],[45,0,47,0],[45,1,45,4],[46,1,46,2],[46,3,46,4],[50,1,50,2],[50,3,50,4]]}
["경제성 평가 일반 - 집합처리와 개별처리의 비교",null,null,null,null,null,null,null,"월곡"]
["개요: 하수처리구역 설정 시 처리구역으로 설정하여 집합처리하는 것과, 처리구역으로 설정하지 않고 개별처리하는 것이 어느 것이 더 경제적인가? "]
["※아래 질문에 대한 답을 오른쪽 노란 칸에 적어 주십시오. 질문에 대한 답을 하실 수 없는 경우에는 파란색 빈칸에 있는 숫자를 노란색 칸에 적어 주십시오"]
[]
["1. 하수처리구역의 목표 BOD를 선택해 주십시오."]
[]
{"$rows_left_out":49}
{"sheet":"월매","index":24,"n_rows":54,"n_cols":11,"rows_kept":54,"cut":false,"hidden":false,"merged":[[19,0,19,6],[0,0,0,6],[1,0,1,6],[2,0,2,6],[4,0,4,6],[6,0,6,6],[8,0,8,6],[10,0,10,6],[12,0,12,6],[13,0,13,6],[15,0,15,6],[17,0,17,6],[41,0,41,2],[21,0,21,6],[23,0,23,6],[24,0,24,6],[25,0,25,6],[27,0,27,6],[29,0,29,6],[31,0,31,6],[33,0,33,6],[35,0,35,6],[37,0,37,6],[39,0,39,6],[51,1,51,4],[52,1,52,4],[53,1,53,4],[45,0,47,0],[45,1,45,4],[46,1,46,2],[46,3,46,4],[50,1,50,2],[50,3,50,4]]}
["경제성 평가 일반 - 집합처리와 개별처리의 비교",null,null,null,null,null,null,null,"월매"]
["개요: 하수처리구역 설정 시 처리구역으로 설정하여 집합처리하는 것과, 처리구역으로 설정하지 않고 개별처리하는 것이 어느 것이 더 경제적인가? "]
["※아래 질문에 대한 답을 오른쪽 노란 칸에 적어 주십시오. 질문에 대한 답을 하실 수 없는 경우에는 파란색 빈칸에 있는 숫자를 노란색 칸에 적어 주십시오"]
[]
["1. 하수처리구역의 목표 BOD를 선택해 주십시오."]
[]
{"$rows_left_out":49}
{"sheet":"옥동","index":25,"n_rows":54,"n_cols":11,"rows_kept":54,"cut":false,"hidden":false,"merged":[[19,0,19,6],[0,0,0,6],[1,0,1,6],[2,0,2,6],[4,0,4,6],[6,0,6,6],[8,0,8,6],[10,0,10,6],[12,0,12,6],[13,0,13,6],[15,0,15,6],[17,0,17,6],[41,0,41,2],[21,0,21,6],[23,0,23,6],[24,0,24,6],[25,0,25,6],[27,0,27,6],[29,0,29,6],[31,0,31,6],[33,0,33,6],[35,0,35,6],[37,0,37,6],[39,0,39,6],[51,1,51,4],[52,1,52,4],[53,1,53,4],[45,0,47,0],[45,1,45,4],[46,1,46,2],[46,3,46,4],[50,1,50,2],[50,3,50,4]]}
["경제성 평가 일반 - 집합처리와 개별처리의 비교",null,null,null,null,null,null,null,"옥동"]
["개요: 하수처리구역 설정 시 처리구역으로 설정하여 집합처리하는 것과, 처리구역으로 설정하지 않고 개별처리하는 것이 어느 것이 더 경제적인가? "]
["※아래 질문에 대한 답을 오른쪽 노란 칸에 적어 주십시오. 질문에 대한 답을 하실 수 없는 경우에는 파란색 빈칸에 있는 숫자를 노란색 칸에 적어 주십시오"]
[]
["1. 하수처리구역의 목표 BOD를 선택해 주십시오."]
[]
{"$rows_left_out":48}